{"text_format":"1","workbook":"xlsx","n_sheets":4,"sheets":["Tabelle1","Tabelle2","Tabelle3","Tabelle4"],"not_rendered":{"charts":0,"images":0,"macros":1,"external_links":0,"defined_names":26,"comments":0,"pivot_tables":0},"unopened":[],"bounds":{"document_bytes":16777216,"sheet_cells":100000,"rows_first":2000,"rows_last":500,"rows_between":2000,"halvings":0,"cell_chars":16384,"cell_head_chars":4096},"cells_cut":0,"cells_raw":0,"read":"whole","date_system":"1900"}

{"sheet":"Tabelle1","index":0,"n_rows":72,"n_cols":72,"rows_kept":72,"cut":false,"hidden":false,"merged":[[0,28,0,29],[0,0,0,11],[2,0,10,0],[15,21,16,26],[12,21,12,22],[12,18,12,20],[13,18,13,20],[13,21,13,22]]}
["Bimaru programmiert von Peter Gallin, 08.02.16 - 05.03.16 (aktualisiert am 17.03.22)",null,null,null,null,null,null,null,null,null,null,null,"Leere","Frei für Was-ser","Was-ser","Be-legt","Was-ser plus Be-legt","Noch zu set-zen","Klar für Was-ser",null,null,"Rech-nen",null,null,null,null,null,null,"Legende",null,null,null,"Loch1","Bele-gung 1","Loch2","Bele-gung 2","Loch3","Bele-gung 3","Loch4","Bele-gung 4","Loch5","Bele-gung 5",null,null,null,"Farb-code",null,null,null,null,null,null,"Loch1","Belegung 1","Loch2","Belegung 2","Loch3","Belegung 3","Loch4","Belegung 4","Loch5","Belegung 5",null,"Total-Belegung 1",null,"Total-Belegung 2",null,"Total-Belegung 3",null,"Total-Belegung 4",null,"Total-Belegung 5"]
[289,"u","w","w","w","w","w","w","w","w","w",1,{"$f":"COUNTIF(B2:K2,\"\")","v":0},{"$f":"M2-L2+P2","v":0},{"$f":"COUNTIF(B2:K2,\"w\")","v":9},{"$f":"10-O2-M2","v":1},{"$f":"O2+P2","v":10},{"$f":"L2-P2","v":0},{"$f":"IF(AND(M2=R2,R2>0),\"ok\",\"\")","v":""},null,null,null,null,null,null,null,null,null,"◯","k",null,null,null,null,null,null,null,null,null,null,null,null,null,"1 Zweier",null,8]
["Tagi, 18.03.22","x","w","w","w","w","w","w","x","l","w",3,0,0,7,3,10,0,"",null,null,null,null,null,null,null,null,null,"☐","q",null,null,null,null,null,null,null,null,null,null,null,null,null,"2 Zweier",null,9]
[null,"x","w","x","w","w","x","w","w","w","w",3,0,0,7,3,10,0,"",null,null,"Rech-nen",null,null,null,null,null,null,"∩","u",null,null,null,null,null,null,null,null,null,null,null,null,null,"3 Zweier",null,10]
[null,"w","w","w","w","w","w","w","w","w","w",0,0,0,10,0,10,0,"",null,null,"Rech-nen",null,null,null,null,null,null,"⊃","l",null,null,null,null,null,null,null,null,null,null,null,null,null,"1 Dreier",null,6]
[null,"w","x","w","w","w","w","w","w","w","x",2,0,0,8,2,10,0,"",null,null,"Rech-nen",null,null,null,null,null,null,"⊂","r",null,null,null,null,null,null,null,null,null,null,null,null,null,"2 Dreier",null,4]
[null,"w","w","w","w",4,4,4,4,"w","w",4,0,0,6,4,10,0,"",null,null,"Rech-nen",null,null,null,null,null,null,"∪","o",null,null,null,null,null,null,null,null,null,null,null,null,null,"1 Vierer",null,7]
[null,"w","x","w","w","w","w","w","w","w","w",1,0,0,9,1,10,0,"",null,null,"Rech-nen",null,null,null,null,null,null,"X","x"]
[null,"w","x","w","w","w","w","w","w","w","w",1,0,0,9,1,10,0,"",null,null,"Rech-nen",null,null,null,null,null,null,"w","w"]
[null,"w","w","w","w","w","w","w","w","w","w",0,0,0,10,0,10,0,"",null,null,"Rech-nen"]
[null,"w","x","l","w","w","x","x","l","w","w",5,0,0,5,5,10,0,"",null,null,"Rech-nen",null,null,null,null,null,null," Bilanz",null,null,"Soll"]
[{"$f":"SUM(B12:K12)","v":20},3,4,2,0,1,3,2,3,1,1,{"$f":"SUM(L2:L11)","v":20},null,null,{"$f":"SUM(O2:O11)","v":80},{"$f":"SUM(P2:P11)","v":20},null,{"$f":"SUM(R2:R11)","v":0},{"$f":"COUNTIF(S2:S11,\"ok\")","v":0},null,null,"Rech-nen",null,null,null,null,null,null,"Einer:",null,4,4]
["Leere",{"$f":"COUNTIF(B2:B11,\"\")","v":0},0,0,0,0,0,0,0,0,0,null,null,"Anzahl Zweierlöcher",null,null,null,null,"Prüfung:",null,null,{"$f":"IF(AND(U10=\"\",U9=\"\",OR(BB14=\"Fehler\",MIN(B13:K18)<0,MIN(M2:R11)<0,Vierer>1,Dreier>2,Zweier>3,Einer>4,AND(R12=0,AE16<10,L12=20))),\"Fehler\",\"OK\")","v":"OK"},null,null,null,null,null,null,"Zweier:",null,3,3,null,null,null,null,null,null,"Die Nummer oben links wird automatisch neu gesetzt.",null,null,null,null,null,null,null,null,null,null,null,null,null,null,"Fehlerangabe für zu wenig Löcher"]
["Frei für Wasser",{"$f":"B13-B12+B16","v":0},0,0,0,0,0,0,0,0,0,null,null,"Anzahl Dreierlöcher",null,null,null,null,"Lösung:",null,null,{"$f":"IF(AND(U10=\"\",SUM(R2:R11)+SUM(B18:K18)=0,V13=\"OK\",O12=80),\"gefunden\",\"\")","v":"gefunden"},null,null,null,null,null,null,"Dreier:",null,2,2,null,null,null,null,null,null,"Evtl. die Nummer oben links setzen."]
["Wasser",{"$f":"COUNTIF(B2:B11,\"w\")","v":7},6,8,10,9,7,8,7,9,9,null,1,"Anzahl Viererlöcher",null,null,null,null,null,null,null,null,null,null,null,null,null,null,"Vierer:",null,1,1,null,null,null,null,null,null,"Nummer des Archivs (Tabelle2) eingeben."]
["Belegt",{"$f":"10-B15-B13","v":3},4,2,0,1,3,2,3,1,1,null,null,null,null,null,null,null,null,null,null,"Suche nach allen Lösungen abgestellt",null,null,null,null,null,null,"Summe:",null,{"$f":"SUM(AE12:AE15)","v":10},null,null,null,null,null,null,null,"6x6-Bimaru holen und dann die gegebenen Zahlen am richtigen Ort (rot um 1 vergrössen"]
["Wasser plus Belegt",{"$f":"B16+B15","v":10},10,10,10,10,10,10,10,10,10]
["Noch zu setzen",{"$f":"B12-B16","v":0},0,0,0,0,0,0,0,0,0]
["Klar für Wasser",{"$f":"IF(AND(B18=B13,B18>0),\"ok\",\"\")","v":""},"","","","","","","","","",{"$f":"COUNTIF(B19:K19,\"ok\")","v":0},null,"⃝",null,null,null,null,{"$f":"IF(B2=\"\",\"\",B2)","v":"u"},{"$f":"IF(C2=\"\",\"\",C2)","v":"w"},{"$f":"IF(D2=\"\",\"\",D2)","v":"w"},{"$f":"IF(E2=\"\",\"\",E2)","v":"w"},{"$f":"IF(F2=\"\",\"\",F2)","v":"w"},{"$f":"IF(G2=\"\",\"\",G2)","v":"w"},{"$f":"IF(H2=\"\",\"\",H2)","v":"w"},{"$f":"IF(I2=\"\",\"\",I2)","v":"w"},{"$f":"IF(J2=\"\",\"\",J2)","v":"w"},{"$f":"IF(K2=\"\",\"\",K2)","v":"w"}]
[null,null,null,null,null,null,null,null,null,null,null,null,null,null,null,null,null,null,"x","w","w","w","w","w","w","x","l","w"]
[null,null,null,null,null,null,null,null,null,null,null,null,null,null,null,null,null,null,"x","w","x","w","w","x","w","w","w","w"]
[null,null,null,null,null,null,null,null,null,null,null,null,null,null,null,null,null,null,"w","w","w","w","w","w","w","w","w","w"]
[null,null,null,null,null,null,null,null,null,null,null,null,null,null,null,null,null,null,"w","x","w","w","w","w","w","w","w","x"]
[null,null,null,null,null,null,null,null,null,null,null,null,null,null,null,null,null,null,"w","w","w","w",4,4,4,4,"w","w"]
[null,null,null,null,null,null,null,null,null,null,null,null,null,null,null,null,null,null,"w","x","w","w","w","w","w","w","w","w"]
[null,null,null,null,null,null,null,null,null,null,null,null,null,null,null,null,null,null,"w","x","w","w","w","w","w","w","w","w"]
[null,null,null,null,null,null,null,null,null,null,null,null,null,null,null,null,null,null,"w","w","w","w","w","w","w","w","w","w"]
[null,null,null,null,null,null,null,null,null,null,null,null,null,null,null,null,null,null,"w","x","l","w","w","x","x","l","w","w"]
[]
[]
[]
[]
["Loch 1",null,null,null,null,null,null,null,null,null,null,null,null,null,null,null,null,null,null,null,null,null,null,null,null,null,null,null,null,null,null,null,{"$f":"B2","v":"u"},{"$f":"C2","v":"w"},{"$f":"D2","v":"w"},{"$f":"E2","v":"w"},{"$f":"F2","v":"w"},{"$f":"G2","v":"w"},{"$f":"H2","v":"w"},{"$f":"I2","v":"w"},{"$f":"J2","v":"w"},{"$f":"K2","v":"w"}]
["Belegung 1",null,null,null,null,null,null,null,null,null,null,null,null,null,null,null,null,null,null,null,null,null,null,null,null,null,null,null,null,null,null,null,"x","w","w","w","w","w","w","x","l","w"]
["Loch 2",null,null,null,null,null,null,null,null,null,null,null,null,null,null,null,null,null,null,null,null,null,null,null,null,null,null,null,null,null,null,null,"x","w","x","w","w","x","w","w","w","w"]
["Belegung 2",null,null,null,null,null,null,null,null,null,null,null,null,null,null,null,null,null,null,null,null,null,null,null,null,null,null,null,null,null,null,null,"w","w","w","w","w","w","w","w","w","w"]
["Loch 3",null,null,null,null,null,null,null,null,null,null,null,null,null,null,null,null,null,null,null,null,null,null,null,null,null,null,null,null,null,null,null,"w","x","w","w","w","w","w","w","w","x"]
["Belegung 3",null,null,null,null,null,null,null,null,null,null,null,null,null,null,null,null,null,null,null,null,null,null,null,null,null,null,null,null,null,null,null,"w","w","w","w",4,4,4,4,"w","w"]
["Loch 4",null,null,null,null,null,null,null,null,null,null,null,null,null,null,null,null,null,null,null,null,null,null,null,null,null,null,null,null,null,null,null,"w","x","w","w","w","w","w","w","w","w"]
["Belegung 4",null,null,null,null,null,null,null,null,null,null,null,null,null,null,null,null,null,null,null,null,null,null,null,null,null,null,null,null,null,null,null,"w","x","w","w","w","w","w","w","w","w"]
["Loch 5",null,null,null,null,null,null,null,null,null,null,null,null,null,null,null,null,null,null,null,null,null,null,null,null,null,null,null,null,null,null,null,"w","w","w","w","w","w","w","w","w","w"]
["Belegung 5",null,null,null,null,null,null,null,null,null,null,null,null,null,null,null,null,null,null,null,null,null,null,null,null,null,null,null,null,null,null,null,"w","x","l","w","w","x","x","l","w","w"]
[]
[]
[]
[]
[]
[]
[]
[]
[]
[]
["Loch 1"]
["Belegung 1"]
["Loch 2"]
["Belegung 2"]
["Loch 3"]
["Belegung 3"]
["Loch 4"]
["Belegung 4"]
["Loch 5"]
["Belegung 5"]
["Totale"]
["Belegung 1"]
[]
["Belegung 2"]
[]
["Belegung 3"]
[]
["Belegung 4"]
[]
["Belegung 5"]

{"sheet":"Tabelle2","index":1,"n_rows":924,"n_cols":117,"rows_kept":924,"cut":false,"hidden":false,"merged":[[877,92,885,92],[889,92,897,92],[902,1,910,1],[914,1,922,1],[877,1,885,1],[889,1,897,1],[852,1,860,1],[864,1,872,1],[677,1,685,1],[689,1,697,1],[764,27,772,27],[664,14,672,14],[689,14,697,14],[852,14,860,14],[864,14,872,14],[864,27,872,27],[877,14,885,14],[889,14,897,14],[877,27,885,27],[889,27,897,27],[814,1,822,1],[814,14,822,14],[814,27,822,27],[827,14,835,14],[839,14,847,14],[827,1,835,1],[839,1,847,1],[664,92,672,92],[677,79,685,79],[702,53,710,53],[727,66,735,66],[739,92,747,92],[802,1,810,1],[802,79,810,79],[802,53,810,53],[702,92,710,92],[714,92,722,92],[752,92,760,92],[739,79,747,79],[677,92,685,92],[689,92,697,92],[702,79,710,79],[689,40,697,40],[664,66,672,66],[777,1,785,1],[752,1,760,1],[764,1,772,1],[764,53,772,53],[764,66,772,66],[789,1,797,1],[802,40,810,40],[627,1,635,1],[639,1,647,1],[752,27,760,27],[652,1,660,1],[677,40,685,40],[664,1,672,1],[702,1,710,1],[714,1,722,1],[702,40,710,40],[714,40,722,40],[652,14,660,14],[627,27,635,27],[627,14,635,14],[727,40,735,40],[739,40,747,40],[727,27,735,27],[739,27,747,27],[727,14,735,14],[739,14,747,14],[727,1,735,1],[739,1,747,1],[702,14,710,14],[714,14,722,14],[702,27,710,27],[639,14,647,14],[777,66,785,66],[714,79,722,79],[752,79,760,79],[714,27,722,27],[677,14,685,14],[689,79,697,79],[689,53,697,53],[689,27,697,27],[639,79,647,79],[689,66,697,66],[664,79,672,79],[664,27,672,27],[664,53,672,53],[714,53,722,53],[702,66,710,66],[714,66,722,66],[752,40,760,40],[727,53,735,53],[739,53,747,53],[752,53,760,53],[752,66,760,66],[777,27,785,27],[677,66,685,66],[677,53,685,53],[627,53,635,53],[639,53,647,53],[652,53,660,53],[627,40,635,40],[639,40,647,40],[652,27,660,27],[602,53,610,53],[614,53,622,53],[614,92,622,92],[602,66,610,66],[652,66,660,66],[614,79,622,79],[614,66,622,66],[602,92,610,92],[577,66,585,66],[589,79,597,79],[477,92,485,92],[539,79,547,79],[489,92,497,92],[502,92,510,92],[514,92,522,92],[527,92,535,92],[539,92,547,92],[627,92,635,92],[639,92,647,92],[602,79,610,79],[627,79,635,79],[652,79,660,79],[652,92,660,92],[627,66,635,66],[639,66,647,66],[552,79,560,79],[514,53,522,53],[489,53,497,53],[539,66,547,66],[477,79,485,79],[489,79,497,79],[489,40,497,40],[477,53,485,53],[477,66,485,66],[489,66,497,66],[502,53,510,53],[527,79,535,79],[552,92,560,92],[552,66,560,66],[564,66,572,66],[564,53,572,53],[577,53,585,53],[589,53,597,53],[552,40,560,40],[577,92,585,92],[589,92,597,92],[564,92,572,92],[564,79,572,79],[589,66,597,66],[577,79,585,79],[577,40,585,40],[589,40,597,40],[464,14,472,14],[502,27,510,27],[514,27,522,27],[552,27,560,27],[552,53,560,53],[564,40,572,40],[514,79,522,79],[464,27,472,27],[539,1,547,1],[527,27,535,27],[539,27,547,27],[539,40,547,40],[477,1,485,1],[489,1,497,1],[527,53,535,53],[539,53,547,53],[527,40,535,40],[464,53,472,53],[514,40,522,40],[527,14,535,14],[489,14,497,14],[539,14,547,14],[502,14,510,14],[514,14,522,14],[302,66,310,66],[277,40,285,40],[289,40,297,40],[302,40,310,40],[352,53,360,53],[314,40,322,40],[364,53,372,53],[402,40,410,40],[414,40,422,40],[364,40,372,40],[377,40,385,40],[389,40,397,40],[327,92,335,92],[339,92,347,92],[339,79,347,79],[339,66,347,66],[352,92,360,92],[339,53,347,53],[339,40,347,40],[327,53,335,53],[327,40,335,40],[352,40,360,40],[364,92,372,92],[352,79,360,79],[364,79,372,79],[327,79,335,79],[327,66,335,66],[252,66,260,66],[264,66,272,66],[252,79,260,79],[264,79,272,79],[252,92,260,92],[264,92,272,92],[302,92,310,92],[314,92,322,92],[314,66,322,66],[302,79,310,79],[314,79,322,79],[364,66,372,66],[277,92,285,92],[289,92,297,92],[352,66,360,66],[277,66,285,66],[289,66,297,66],[277,79,285,79],[289,79,297,79],[252,53,260,53],[264,53,272,53],[227,53,235,53],[239,53,247,53],[202,53,210,53],[214,53,222,53],[314,53,322,53],[277,53,285,53],[289,53,297,53],[302,53,310,53],[177,92,185,92],[189,92,197,92],[227,66,235,66],[239,66,247,66],[227,79,235,79],[239,79,247,79],[177,79,185,79],[177,66,185,66],[189,66,197,66],[189,79,197,79],[227,92,235,92],[239,92,247,92],[202,92,210,92],[214,92,222,92],[202,66,210,66],[214,66,222,66],[202,79,210,79],[214,79,222,79],[64,1,72,1],[102,14,110,14],[114,14,122,14],[102,27,110,27],[114,27,122,27],[102,1,110,1],[114,1,122,1],[89,1,97,1],[77,1,85,1],[77,27,85,27],[89,14,97,14],[152,92,160,92],[164,92,172,92],[2,40,10,40],[14,40,22,40],[114,66,122,66],[102,79,110,79],[2,53,10,53],[14,53,22,53],[39,66,47,66],[52,79,60,79],[52,66,60,66],[77,79,85,79],[89,79,97,79],[64,66,72,66],[64,53,72,53],[139,53,147,53],[77,66,85,66],[89,66,97,66],[89,40,97,40],[102,40,110,40],[102,53,110,53],[114,53,122,53],[114,40,122,40],[89,53,97,53],[139,1,147,1],[2,92,10,92],[14,92,22,92],[2,79,10,79],[14,79,22,79],[52,92,60,92],[64,92,72,92],[27,92,35,92],[39,92,47,92],[27,79,35,79],[39,79,47,79],[2,66,10,66],[14,66,22,66],[27,66,35,66],[2,1,10,1],[14,1,22,1],[2,14,10,14],[14,14,22,14],[2,27,10,27],[14,27,22,27],[27,40,35,40],[27,53,35,53],[27,14,35,14],[27,27,35,27],[27,1,35,1],[39,1,47,1],[64,79,72,79],[127,66,135,66],[127,53,135,53],[102,66,110,66],[77,14,85,14],[77,40,85,40],[39,40,47,40],[52,40,60,40],[52,53,60,53],[39,53,47,53],[39,14,47,14],[39,27,47,27],[64,40,72,40],[77,53,85,53],[127,27,135,27],[89,27,97,27],[127,1,135,1],[52,1,60,1],[52,14,60,14],[64,14,72,14],[52,27,60,27],[64,27,72,27],[77,92,85,92],[89,92,97,92],[152,1,160,1],[127,14,135,14],[152,14,160,14],[164,14,172,14],[152,27,160,27],[164,27,172,27],[114,79,122,79],[164,79,172,79],[152,66,160,66],[164,66,172,66],[152,79,160,79],[127,92,135,92],[139,92,147,92],[102,92,110,92],[139,14,147,14],[152,53,160,53],[114,92,122,92],[127,40,135,40],[139,40,147,40],[139,66,147,66],[127,79,135,79],[139,79,147,79],[214,27,222,27],[227,1,235,1],[239,1,247,1],[164,53,172,53],[152,40,160,40],[164,40,172,40],[177,40,185,40],[189,40,197,40],[177,27,185,27],[189,27,197,27],[177,53,185,53],[189,53,197,53],[202,40,210,40],[214,40,222,40],[164,1,172,1],[252,40,260,40],[264,40,272,40],[227,40,235,40],[239,40,247,40],[139,27,147,27],[177,1,185,1],[189,1,197,1],[177,14,185,14],[202,1,210,1],[214,1,222,1],[252,14,260,14],[264,14,272,14],[252,27,260,27],[264,27,272,27],[189,14,197,14],[227,14,235,14],[239,14,247,14],[227,27,235,27],[239,27,247,27],[252,1,260,1],[264,1,272,1],[202,14,210,14],[214,14,222,14],[202,27,210,27],[289,14,297,14],[289,27,297,27],[327,14,335,14],[339,14,347,14],[327,27,335,27],[277,1,285,1],[289,1,297,1],[302,1,310,1],[314,1,322,1],[339,27,347,27],[302,27,310,27],[314,27,322,27],[302,14,310,14],[314,14,322,14],[277,14,285,14],[327,1,335,1],[339,1,347,1],[277,27,285,27],[352,1,360,1],[364,1,372,1],[389,1,397,1],[377,14,385,14],[389,14,397,14],[352,14,360,14],[364,14,372,14],[352,27,360,27],[364,27,372,27],[377,1,385,1],[377,27,385,27],[389,27,397,27],[377,92,385,92],[414,92,422,92],[414,53,422,53],[389,92,397,92],[402,92,410,92],[377,79,385,79],[389,79,397,79],[402,79,410,79],[414,79,422,79],[377,53,385,53],[389,53,397,53],[377,66,385,66],[389,66,397,66],[402,53,410,53],[402,66,410,66],[414,66,422,66],[427,92,435,92],[439,92,447,92],[452,92,460,92],[464,92,472,92],[452,66,460,66],[464,40,472,40],[452,53,460,53],[564,27,572,27],[414,1,422,1],[452,40,460,40],[452,79,460,79],[464,66,472,66],[464,79,472,79],[427,79,435,79],[439,79,447,79],[427,53,435,53],[439,53,447,53],[427,40,435,40],[439,40,447,40],[502,1,510,1],[527,1,535,1],[527,66,535,66],[477,40,485,40],[502,79,510,79],[402,1,410,1],[427,66,435,66],[439,66,447,66],[514,1,522,1],[477,27,485,27],[489,27,497,27],[427,1,435,1],[427,27,435,27],[452,14,460,14],[439,1,447,1],[439,27,447,27],[477,14,485,14],[452,1,460,1],[427,14,435,14],[439,14,447,14],[402,14,410,14],[414,14,422,14],[402,27,410,27],[414,27,422,27],[502,66,510,66],[514,66,522,66],[502,40,510,40],[452,27,460,27],[464,1,472,1],[814,53,822,53],[827,27,835,27],[552,1,560,1],[564,1,572,1],[602,14,610,14],[614,14,622,14],[577,1,585,1],[589,1,597,1],[577,27,585,27],[589,27,597,27],[577,14,585,14],[552,14,560,14],[564,14,572,14],[589,14,597,14],[602,1,610,1],[614,1,622,1],[652,40,660,40],[677,27,685,27],[602,27,610,27],[614,27,622,27],[602,40,610,40],[614,40,622,40],[664,40,672,40],[639,27,647,27],[789,92,797,92],[764,79,772,79],[727,92,735,92],[802,92,810,92],[764,92,772,92],[764,40,772,40],[752,14,760,14],[764,14,772,14],[777,14,785,14],[777,40,785,40],[777,53,785,53],[777,79,785,79],[777,92,785,92],[789,66,797,66],[789,79,797,79],[789,14,797,14],[789,40,797,40],[802,14,810,14],[802,27,810,27],[789,27,797,27],[789,53,797,53],[739,66,747,66],[839,27,847,27],[827,66,835,66],[839,66,847,66],[827,79,835,79],[839,79,847,79],[852,27,860,27],[852,40,860,40],[827,92,835,92],[839,92,847,92],[827,40,835,40],[839,40,847,40],[827,53,835,53],[839,53,847,53],[2,105,10,105],[877,79,885,79],[889,79,897,79],[877,40,885,40],[889,40,897,40],[864,40,872,40],[852,53,860,53],[864,53,872,53],[852,66,860,66],[864,66,872,66],[852,79,860,79],[864,79,872,79],[877,53,885,53],[889,53,897,53],[877,66,885,66],[889,66,897,66],[852,92,860,92],[864,92,872,92],[814,92,822,92],[802,66,810,66],[814,66,822,66],[814,79,822,79],[814,40,822,40],[727,79,735,79]]}
[null,null,"Tagi, 22.05.21",null,null,null,null,null,null,null,null,null,null,null,null,"Tagi, 25.05.21",null,null,null,null,null,null,null,null,null,null,null,null,"Beobachter, 21.05.21",null,null,null,null,null,null,null,null,null,null,null,null,"Migros-Magazin, 25.05.21",null,null,null,null,null,null,null,null,null,null,null,null,"Tagi, 26.05.21",null,null,null,null,null,null,null,null,null,null,null,null,"Tagi, 27.05.21",null,null,null,null,null,null,null,null,null,null,null,null,"Tagi, 28.05.21",null,null,null,null,null,null,null,null,null,null,null,null,"Tagi, 29.05.21"]
[null,1,null,null,null,null,null,null,null,null,null,null,1,null,2,null,"l",null,null,null,null,null,null,null,null,4,null,3,null,null,null,null,null,null,null,null,null,null,0,null,4,null,null,null,null,null,null,null,"q",null,null,4,null,5,null,null,null,null,null,null,null,null,null,null,1,null,6,null,null,null,"k",null,null,null,null,null,null,1,null,7,null,null,null,null,null,null,null,null,null,"w",1,null,8,"k",null,null,null,null,null,null,null,null,null,1,null,null,"w","w","w","w","w","w","w","x","x","x",3]
[null,"Tagi, 22.05.21",null,null,null,null,null,null,null,null,null,null,1,null,"Tagi, 25.05.21",null,null,null,null,null,null,null,null,null,null,0,null,"Beobachter, 21.05.21",null,null,null,null,null,null,null,null,null,null,0,null,"Migros-Magazin, 25.05.21",null,null,null,null,null,null,null,null,null,null,0,null,"Tagi, 26.05.21",null,null,null,null,null,null,null,null,null,null,2,null,"Tagi, 27.05.21",null,null,null,null,null,null,null,null,null,null,4,null,"Tagi, 28.05.21",null,null,null,null,null,null,null,null,null,null,3,null,"Tagi, 29.05.21",null,null,null,null,null,null,"r",null,null,null,2,null,null,"w","w","w","w","w","w","w","w","w","w",0]
[null,null,null,null,null,null,null,null,"o",null,null,null,2,null,null,null,null,null,null,null,null,null,null,null,null,1,null,null,null,null,null,null,"k",null,null,null,null,null,4,null,null,"k",null,null,null,null,null,null,null,null,null,3,null,null,null,null,null,null,null,null,null,null,null,null,3,null,null,null,null,null,null,null,null,null,null,null,null,0,null,null,null,null,null,null,null,null,null,"u",null,null,3,null,null,null,null,null,null,null,null,null,null,null,null,4,null,null,"w","x","x","w","w","w","x","w","w","w",3]
[null,null,null,null,null,null,null,null,null,null,null,null,2,null,null,null,null,null,null,null,null,null,null,null,null,3,null,null,null,null,null,null,null,null,null,null,null,null,2,null,null,null,null,"r",null,null,null,null,null,null,null,3,null,null,null,null,null,null,null,null,null,null,null,null,0,null,null,null,null,null,null,null,null,"r",null,null,null,5,null,null,null,"k",null,null,null,null,null,null,null,null,5,null,null,null,null,null,null,null,null,null,null,null,null,1,null,null,"w","w","w","w","w","w","w","w","w","w",0]
[null,null,null,null,null,null,null,null,null,null,null,null,5,null,null,null,null,null,null,null,null,null,null,null,null,2,null,null,null,null,null,null,null,null,null,null,null,null,0,null,null,null,null,null,null,null,null,null,null,null,null,0,null,null,null,null,null,null,null,null,null,null,"r",null,4,null,null,null,null,null,null,null,null,null,null,null,null,0,null,null,null,null,null,null,null,null,null,null,null,null,0,null,null,null,null,null,null,null,null,null,null,null,null,0,null,null,"x","w","w","w",null,null,null,null,null,null,4]
[null,null,null,null,null,null,null,null,null,null,null,null,3,null,null,null,"o",null,null,null,null,null,null,null,null,2,null,null,null,null,null,null,null,null,null,null,null,null,4,null,null,null,null,null,null,null,null,null,null,null,null,0,null,null,null,null,null,null,null,null,null,null,null,null,0,null,null,null,null,null,null,null,null,null,null,null,null,1,null,null,null,null,null,null,null,"u",null,null,null,null,2,null,null,null,null,null,null,null,null,null,null,"u",null,4,null,null,"x","w","w","w",null,null,null,null,null,null,2]
[null,null,null,null,null,null,null,null,null,null,null,null,1,null,null,null,null,null,null,null,null,null,null,null,null,0,null,null,null,null,null,null,null,null,null,null,null,null,2,null,null,null,null,null,null,null,null,null,null,null,null,6,null,null,"w",null,null,null,null,null,null,null,null,null,4,null,null,null,null,null,null,null,null,null,null,null,null,3,null,null,null,null,null,null,null,null,null,null,null,null,2,null,null,null,null,null,null,null,null,null,null,null,null,1,null,null,"x","w","w","w",null,null,null,null,null,null,3]
[null,null,null,"u",null,null,null,"k",null,null,null,null,2,null,null,null,null,"k",null,null,null,null,null,null,null,4,null,null,null,null,null,null,null,null,null,null,null,null,1,null,null,null,null,null,null,null,null,null,null,null,null,1,null,null,null,null,null,null,null,null,null,"k",null,null,1,null,null,"o",null,null,null,null,null,null,null,null,null,2,null,null,null,null,null,null,null,null,null,null,null,null,3,null,null,null,null,null,null,null,null,null,null,null,null,2,null,null,"x","w","w","w",null,null,null,null,null,null,1]
[null,null,null,null,null,null,null,null,null,null,null,null,2,null,null,null,null,null,null,null,null,null,null,null,null,0,null,null,null,null,null,null,null,null,"q",null,null,null,6,null,null,null,null,null,null,null,null,null,null,null,null,1,null,null,null,null,null,null,null,null,null,null,null,null,0,null,null,null,null,null,null,"l",null,null,null,null,null,2,null,null,null,null,null,null,null,null,null,null,null,null,0,null,null,null,null,null,"r",null,null,null,null,null,null,3,null,null,"w","w","w","w",null,null,null,"r",null,null,2]
[null,null,null,null,null,null,null,null,null,null,null,null,1,null,null,"r",null,null,null,null,null,null,null,null,null,4,null,null,null,null,null,null,null,null,null,null,null,null,1,null,null,null,null,null,null,null,"w",null,null,null,null,2,null,null,null,null,null,null,null,null,null,null,null,null,5,null,null,null,null,null,null,null,null,null,null,null,null,2,null,null,null,null,null,null,null,null,null,null,null,null,1,null,null,null,null,null,null,null,null,null,null,null,null,2,null,null,"w","w","w","w",null,null,null,null,null,null,2]
[null,{"$f":"SUM(C12:L12)","v":20},2,3,0,4,0,1,6,0,1,3,{"$f":"SUM(M2:M11)","v":20},null,{"$f":"SUM(P12:Y12)","v":20},2,4,2,0,4,2,0,1,3,2,{"$f":"SUM(Z2:Z11)","v":20},null,{"$f":"SUM(AC12:AL12)","v":20},0,0,5,0,2,2,1,4,1,5,{"$f":"SUM(AM2:AM11)","v":20},null,{"$f":"SUM(AP12:AY12)","v":20},1,1,2,3,0,3,4,1,1,4,{"$f":"SUM(AZ2:AZ11)","v":20},null,{"$f":"SUM(BC12:BL12)","v":20},1,2,5,1,1,1,5,2,1,1,{"$f":"SUM(BM2:BM11)","v":20},null,{"$f":"SUM(BP12:BY12)","v":20},2,2,1,3,2,0,2,6,1,1,{"$f":"SUM(BZ2:BZ11)","v":20},null,{"$f":"SUM(CC12:CL12)","v":20},2,2,1,4,0,3,1,2,0,5,{"$f":"SUM(CM2:CM11)","v":20},null,{"$f":"SUM(CP12:CY12)","v":20},4,2,1,3,1,1,1,1,5,1,{"$f":"SUM(CZ2:CZ11)","v":20},null,{"$f":"SUM(DC12:DL12)","v":20},4,1,1,0,1,4,1,3,2,3,{"$f":"SUM(DM2:DM11)","v":20}]
[null,null,"Lösung",null,null,null,null,null,null,null,null,null,null,null,null,"Lösung",null,null,null,null,null,null,null,null,null,null,null,null,"Lösung",null,null,null,null,null,null,null,null,null,null,null,null,"Lösung",null,null,null,null,null,null,null,null,null,null,null,null,"Lösung",null,null,null,null,null,null,null,null,null,null,null,null,"Lösung",null,null,null,null,null,null,null,null,null,null,null,null,"Lösung",null,null,null,null,null,null,null,null,null,null,null,null,"Lösung"]
[null,1,"w","w","w","w","w","w","x","w","w","w",1,null,2,"x","l","w","w","w","x","w","w","x","w",4,null,3,"w","w","w","w","w","w","w","w","w","w",0,null,4,"w","w","w","w","w","x","x","x","x","w",4,null,5,"w","w","w","w","w","w","x","w","w","w",1,null,6,"w","w","w","k","w","w","w","w","w","w",1,null,7,"w","w","w",4,"w","w","w","w","w","w",1,null,8,"k","w","w","w","w","w","w","w","w","w",1]
[null,"Tagi, 22.05.21","w","w","w","w","w","w","x","w","w","w",1,null,"Tagi, 25.05.21","w","w","w","w","w","w","w","w","w","w",0,null,"Beobachter, 21.05.21","w","w","w","w","w","w","w","w","w","w",0,null,"Migros-Magazin, 25.05.21","w","w","w","w","w","w","w","w","w","w",0,null,"Tagi, 26.05.21","w","w","x","w","w","w","x","w","w","w",2,null,"Tagi, 27.05.21","w","w","w","w","w","w","x","x","x","x",4,null,"Tagi, 28.05.21","x","w","w",4,"w","w","w","w","w",3,3,null,"Tagi, 29.05.21","w","w","w","w","w","w","r","l","w","w",2]
[null,null,"x","w","w","w","w","w","o","w","w","w",2,null,null,"w","w","w","w",4,"w","w","w","w","w",1,null,null,"w","w","x","w","k","w","w","x","w","x",4,null,null,"k","w","w","w","w",2,2,"w","w","w",3,null,null,"x","w","x","w","w","w","x","w","w","w",3,null,null,"w","w","w","w","w","w","w","w","w","w",0,null,null,"w","w","w",4,"w","w","w","u","w",3,3,null,null,"x","x","x","x","w","w","w","w","w","w",4]
[null,null,"w","w","w","x","w","w","w","w","w",3,2,null,null,"w","w","w","w",4,"w","w","w","x","x",3,null,null,"w","w","x","w","w","w","w","x","w","w",2,null,null,"w","w","r","x","w","w","w","w","w","x",3,null,null,"w","w","w","w","w","w","w","w","w","w",0,null,null,"w","x",3,3,"w","w","r","x","w","w",5,null,null,"w","k","w",4,"w","x","w","o","w",3,5,null,null,"w","w","w","w","w","w","w","w","x","w",1]
[null,null,"x","x","w","x","w","w","x","w","w",3,5,null,null,"w","x","w","w",4,"w","w","w","w","w",2,null,null,"w","w","w","w","w","w","w","w","w","w",0,null,null,"w","w","w","w","w","w","w","w","w","w",0,null,null,"w","w","x","w","w","w","x","w","r","x",4,null,null,"w","w","w","w","w","w","w","w","w","w",0,null,null,"w","w","w","w","w","w","w","w","w","w",0,null,null,"w","w","w","w","w","w","w","w","w","w",0]
[null,null,"w","w","w","x","w","w","x","w","w","x",3,null,null,"w","o","w","w",4,"w","w","w","w","w",2,null,null,"w","w","x","w","w","w","w","x","x","x",4,null,null,"w","w","w","w","w","w","w","w","w","w",0,null,null,"w","w","w","w","w","w","w","w","w","w",0,null,null,"w","w","w","w","w","w","w","x","w","w",1,null,null,"w","w","w","w","w","u","w","w","w","x",2,null,null,"x","x","w","x","w","w","w","w","u","w",4]
[null,null,"w","w","w","x","w","w","w","w","w","w",1,null,null,"w","w","w","w","w","w","w","w","w","w",0,null,null,"w","w","x","w","w","x","w","w","w","w",2,null,null,"w","x","x","x","w","x","x","w","w","x",6,null,null,"w","x","x","x","x","w","w","w","w","w",4,null,null,"u","w","w","w","x","w","w","x","w","w",3,null,null,"w","w","w","w","w","x","w","w","w","x",2,null,null,"w","w","w","w","w","w","w","w","x","w",1]
[null,null,"w","u","w","w","w","k","w","w","w","w",2,null,null,"w","w","k","w","w","w","w",3,3,3,4,null,null,"w","w","w","w","w","w","w","w","w","x",1,null,null,"w","w","w","w","w","w","w","w","w",3,1,null,null,"w","w","w","w","w","w","w","k","w","w",1,null,null,"o","w","w","w","w","w","w","x","w","w",2,null,null,"x","x","x","w","w","w","w","w","w","w",3,null,null,"x","w","w","w","w","w","w","w",3,"w",2]
[null,null,"w","x","w","w","w","w","w","w","x","w",2,null,null,"w","w","w","w","w","w","w","w","w","w",0,null,null,"w","w","x","w","x","x","x","x","w","x",6,null,null,"w","w","w","w","w","w","w","w","w",3,1,null,null,"w","w","w","w","w","w","w","w","w","w",0,null,null,"w","w","w","r","l","w","w","w","w","w",2,null,null,"w","w","w","w","w","w","w","w","w","w",0,null,null,"w","w","w",3,3,3,"w","w","w","w",3]
[null,null,"w","w","w","w","w","w","x","w","w","w",1,null,null,"r","x","x","w","w","x","w","w","w","w",4,null,null,"w","w","w","w","w","w","w","w","w","x",1,null,null,"w","w","w","x","w","w","x","w","w","w",2,null,null,"w","x","x","w","w","x","x","x","w","w",5,null,null,"w","x","w","w","w","w","w","x","w","w",2,null,null,"w","w","w","w","w","w","x","w","w","w",1,null,null,"w","w","w","w","w","w","w","w","x","x",2]
[null,{"$f":"SUM(C24:L24)","v":20},2,3,0,4,0,1,6,0,1,3,{"$f":"SUM(M14:M23)","v":20},null,{"$f":"SUM(P24:Y24)","v":20},2,4,2,0,4,2,0,1,3,2,{"$f":"SUM(Z14:Z23)","v":20},null,{"$f":"SUM(AC24:AL24)","v":20},0,0,5,0,2,2,1,4,1,5,{"$f":"SUM(AM14:AM23)","v":20},null,{"$f":"SUM(AP24:AY24)","v":20},1,1,2,3,0,3,4,1,1,4,{"$f":"SUM(AZ14:AZ23)","v":20},null,{"$f":"SUM(BC24:BL24)","v":20},1,2,5,1,1,1,5,2,1,1,{"$f":"SUM(BM14:BM23)","v":20},null,{"$f":"SUM(BP24:BY24)","v":20},2,2,1,3,2,0,2,6,1,1,{"$f":"SUM(BZ14:BZ23)","v":20},null,{"$f":"SUM(CC24:CL24)","v":20},2,2,1,4,0,3,1,2,0,5,{"$f":"SUM(CM14:CM23)","v":20},null,{"$f":"SUM(CP24:CY24)","v":20},4,2,1,3,1,1,1,1,5,1,{"$f":"SUM(CZ14:CZ23)","v":20}]
[]
[null,null,"Tagi, 31.05.21",null,null,null,null,null,null,null,null,null,null,null,null,"Migros-Magazin, 31.05.21",null,null,null,null,null,null,null,null,null,null,null,null,"Tagi, 01.06.21",null,null,null,null,null,null,null,null,null,null,null,null,"Tagi, 02.06.21",null,null,null,null,null,null,null,null,null,null,null,null,"Tagi, 03.06.21",null,null,null,null,null,null,null,null,null,null,null,null,"Tagi, 04.06.21",null,null,null,null,null,null,null,null,null,null,null,null,"Beobachter, 04.06.21",null,null,null,null,null,null,null,null,null,null,null,null,"Tagi, 05.06.21"]
[null,9,null,null,null,null,null,null,null,"w",null,null,3,null,10,null,null,null,null,null,null,null,null,null,"w",1,null,11,null,null,null,null,null,"k",null,null,null,null,3,null,12,null,null,null,null,null,null,null,null,null,null,1,null,13,null,"u",null,null,null,null,null,null,null,null,1,null,14,null,null,null,null,"w",null,null,null,null,null,1,null,15,null,null,null,null,null,null,null,null,null,null,0,null,16,null,null,null,null,null,null,null,null,null,null,3]
[null,"Tagi, 31.05.21",null,null,"u",null,null,null,null,null,null,null,1,null,"Migros-Magazin, 31.05.21",null,null,null,null,null,null,null,null,null,null,5,null,"Tagi, 01.06.21",null,null,null,null,null,null,null,null,null,null,2,null,"Tagi, 02.06.21",null,null,null,null,null,null,null,"l",null,null,3,null,"Tagi, 03.06.21",null,null,null,null,null,null,null,null,null,null,3,null,"Tagi, 04.06.21",null,null,null,null,null,null,null,null,null,null,1,null,"Beobachter, 04.06.21",null,null,null,null,null,null,null,null,null,null,0,null,"Tagi, 05.06.21",null,null,null,null,null,null,null,null,null,null,0]
[null,null,null,null,null,null,null,null,null,null,null,null,2,null,null,null,null,null,null,null,null,null,null,null,null,0,null,null,null,null,"q",null,null,null,null,null,null,null,3,null,null,null,null,null,null,null,null,null,null,null,null,2,null,null,null,null,null,null,null,null,null,null,null,null,2,null,null,null,null,null,null,null,null,null,null,null,null,2,null,null,null,null,null,null,null,null,null,"w",null,null,4,null,null,null,null,null,null,null,null,null,null,null,null,5]
[null,null,null,null,null,null,null,null,null,null,null,null,2,null,null,null,null,null,null,null,null,null,null,null,null,0,null,null,null,null,null,null,null,null,null,null,null,null,2,null,null,null,null,null,null,null,null,null,null,null,null,1,null,null,null,null,null,null,null,null,null,null,null,null,1,null,null,null,null,null,null,null,null,null,null,null,null,3,null,null,null,null,null,null,null,null,null,null,null,null,0,null,null,null,null,null,null,null,null,null,null,null,null,0]
[null,null,null,null,null,null,null,"k",null,null,null,null,2,null,null,null,null,null,null,null,null,null,null,"l",null,5,null,null,null,null,null,null,null,null,null,null,null,null,0,null,null,"u",null,null,null,null,null,null,null,null,null,4,null,null,null,null,null,null,null,null,null,null,null,null,2,null,null,null,null,null,null,null,null,"l",null,null,null,3,null,null,null,null,null,null,null,"k",null,null,null,null,3,null,null,null,null,"l",null,null,null,null,null,null,null,2]
[null,null,null,null,null,null,null,null,null,null,null,null,1,null,null,null,null,null,null,null,null,null,null,null,null,1,null,null,null,null,null,null,null,null,null,null,null,null,2,null,null,null,null,null,null,null,null,null,null,null,null,1,null,null,null,null,null,null,null,null,null,"u",null,null,3,null,null,null,"u",null,null,null,null,null,null,null,null,1,null,null,null,null,null,null,null,null,null,null,null,null,3,null,null,null,null,null,null,null,null,null,null,null,null,0]
[null,null,null,null,null,null,null,null,null,null,null,null,1,null,null,null,null,null,null,null,null,null,null,null,null,1,null,null,null,null,null,null,null,"o",null,null,null,null,3,null,null,null,null,null,null,null,null,null,null,null,null,0,null,null,null,"r",null,null,null,null,null,null,null,null,4,null,null,null,null,null,null,null,null,null,null,null,null,1,null,null,null,null,null,null,null,null,null,null,null,null,0,null,null,null,null,null,null,null,null,null,null,null,null,0]
[null,null,null,null,null,null,null,null,null,null,null,null,3,null,null,null,null,"o",null,null,null,null,null,null,null,2,null,null,null,null,null,null,null,null,null,null,null,null,0,null,null,null,null,null,null,"w",null,null,null,null,null,4,null,null,null,null,null,null,null,null,null,null,null,null,0,null,null,null,null,null,null,null,null,null,null,null,null,4,null,null,null,null,null,null,null,null,null,null,null,null,5,null,null,null,null,null,null,null,null,null,null,null,null,4]
[null,null,null,null,null,null,null,null,null,null,null,null,3,null,null,null,null,null,null,null,null,null,null,null,null,0,null,null,null,null,null,null,null,null,null,null,null,null,1,null,null,null,null,null,null,null,null,null,null,null,null,2,null,null,null,null,null,null,null,null,null,null,null,null,2,null,null,null,null,null,null,null,null,null,null,null,null,2,null,null,null,null,null,null,null,null,null,null,null,null,1,null,null,null,null,null,null,null,null,null,null,"q",null,3]
[null,null,null,null,null,"l",null,null,null,null,null,null,2,null,null,null,null,null,null,null,null,null,null,"k",null,5,null,null,"k",null,null,null,null,null,null,null,null,null,4,null,null,null,null,null,null,null,null,null,null,null,null,2,null,null,null,null,null,null,null,null,null,null,"w",null,2,null,null,"k",null,null,null,null,null,null,null,null,null,2,null,null,null,null,null,null,null,null,null,null,null,null,4,null,null,null,null,null,null,null,"k",null,null,null,null,3]
[null,{"$f":"SUM(C37:L37)","v":20},4,0,5,1,0,1,0,6,1,2,{"$f":"SUM(M27:M36)","v":20},null,{"$f":"SUM(P37:Y37)","v":20},2,0,2,1,5,2,3,1,3,1,{"$f":"SUM(Z27:Z36)","v":20},null,{"$f":"SUM(AC37:AL37)","v":20},4,1,4,0,3,4,1,2,0,1,{"$f":"SUM(AM27:AM36)","v":20},null,{"$f":"SUM(AP37:AY37)","v":20},2,3,0,1,3,2,1,4,0,4,{"$f":"SUM(AZ27:AZ36)","v":20},null,{"$f":"SUM(BC37:BL37)","v":20},1,4,3,1,0,4,0,4,2,1,{"$f":"SUM(BM27:BM36)","v":20},null,{"$f":"SUM(BP37:BY37)","v":20},2,4,0,0,3,1,3,0,0,7,{"$f":"SUM(BZ27:BZ36)","v":20},null,{"$f":"SUM(CC37:CL37)","v":20},0,0,5,3,2,2,0,5,1,2,{"$f":"SUM(CM27:CM36)","v":20},null,{"$f":"SUM(CP37:CY37)","v":20},5,2,3,0,2,2,1,1,3,1,{"$f":"SUM(CZ27:CZ36)","v":20}]
[null,null,"Lösung",null,null,null,null,null,null,null,null,null,null,null,null,"Lösung",null,null,null,null,null,null,null,null,null,null,null,null,"Lösung",null,null,null,null,null,null,null,null,null,null,null,null,"Lösung",null,null,null,null,null,null,null,null,null,null,null,null,"Lösung",null,null,null,null,null,null,null,null,null,null,null,null,"Lösung",null,null,null,null,null,null,null,null,null,null,null,null,"Lösung",null,null,null,null,null,null,null,null,null,null,null,null,"Lösung"]
[null,9,"x","w","w","w","w","w","w","w","x","x",3,null,10,"x","w","w","w","w","w","w","w","w","w",1,null,11,3,"w",4,"w","w","k","w","w","w","w",3,null,12,"w","w","w","w","x","w","w","w","w","w",1,null,13,"w",3,"w","w","w","w","w","w","w","w",1,null,14,"w","w","w","w","w","w","x","w","w","w",1,null,15,"w","w","w","w","w","w","w","w","w","w",0,null,16,"x","x","w","w","w","w","w","w","w","x",3]
[null,"Tagi, 31.05.21","w","w",3,"w","w","w","w","w","w","w",1,null,"Migros-Magazin, 31.05.21","w","w","w","w",3,3,3,"w","x","x",5,null,"Tagi, 01.06.21",3,"w",4,"w","w","w","w","w","w","w",2,null,"Tagi, 02.06.21","w","w","w","w","w","w","x","l","w","x",3,null,"Tagi, 03.06.21","w",3,"w","w","w","w","w","x","x","w",3,null,"Tagi, 04.06.21","w","w","w","w","w","w","w","w","w","x",1,null,"Beobachter, 04.06.21","w","w","w","w","w","w","w","w","w","w",0,null,"Tagi, 05.06.21","w","w","w","w","w","w","w","w","w","w",0]
[null,null,"w","w",3,"w","w","w","w","x","w","w",2,null,null,"w","w","w","w","w","w","w","w","w","w",0,null,null,3,"w",4,"w","x","w","w","w","w","w",3,null,null,"w","w","w","w","x","w","w","w","w","x",2,null,null,"w",3,"w","w","w",4,"w","w","w","w",2,null,null,"w","w","w","w","x","w","w","w","w","x",2,null,null,"w","w","x","x","x","w","w","w","x","w",4,null,null,"x","w","w","w","x","x","x","x","w","w",5]
[null,null,"w","w",3,"w","w","w","w","x","w","w",2,null,null,"w","w","w","w","w","w","w","w","w","w",0,null,null,"w","w",4,"w","x","w","w","w","w","w",2,null,null,"w","w","w","w","w","w","w","w","w","x",1,null,null,"w","w","w","w","w",4,"w","w","w","w",1,null,null,"x","x","w","w","w","w","w","w","w","x",3,null,null,"w","w","w","w","w","w","w","w","w","w",0,null,null,"w","w","w","w","w","w","w","w","w","w",0]
[null,null,"w","w","w","w","w","k","w","x","w","w",2,null,null,"x","w","w","w","x","w",3,"x","l","w",5,null,null,"w","w","w","w","w","w","w","w","w","w",0,null,null,"u","w","w","w","x","x","w","w","w","x",4,null,null,"w","w","x","w","w",4,"w","w","w","w",2,null,null,"w","w","w","w","w","x","l","w","w","x",3,null,null,"w","w","x","w","w","k","w","x","w","w",3,null,null,"w","r","l","w","w","w","w","w","w","w",2]
[null,null,"w","w","w","w","w","w","w","x","w","w",1,null,null,"w","w","w","w","x","w","w","w","w","w",1,null,null,"w","w","w","w","w","x","w","x","w","w",2,null,null,"o","w","w","w","w","w","w","w","w","w",1,null,null,"w","w","w","w","w","x","w","u","w","x",3,null,null,"w","u","w","w","w","w","w","w","w","w",1,null,null,"w","w","x","w","w","w","w","x","w","x",3,null,null,"w","w","w","w","w","w","w","w","w","w",0]
[null,null,3,"w","w","w","w","w","w","w","w","w",1,null,null,"w","w","u","w","w","w","w","w","w","w",1,null,null,"w","x","w","w","w","o","w","x","w","w",3,null,null,"w","w","w","w","w","w","w","w","w","w",0,null,null,"w",3,3,3,"w","w","w","x","w","w",4,null,null,"w","x","w","w","w","w","w","w","w","w",1,null,null,"w","w","w","w","w","w","w","w","w","w",0,null,null,"w","w","w","w","w","w","w","w","w","w",0]
[null,null,3,"w","x","w","w","w","w","x","w","w",3,null,null,"w","w","o","w","x","w","w","w","w","w",2,null,null,"w","w","w","w","w","w","w","w","w","w",0,null,null,"w",3,"w","x","w","x","w",3,"w","w",4,null,null,"w","w","w","w","w","w","w","w","w","w",0,null,null,"w","x","w","w","x","w","x","w","w","x",4,null,null,"w","w",4,4,4,4,"w","x","w","w",5,null,null,"x","w","x","w","x","w","w","w","x","w",4]
[null,null,3,"w","w","w","w","w","w","x","w","x",3,null,null,"w","w","w","w","w","w","w","w","w","w",0,null,null,"w","w","w","w","w","w","w","w","w","x",1,null,null,"w",3,"w","w","w","w","w",3,"w","w",2,null,null,"w","w","w","w","w","w","w","x","x","w",2,null,null,"w","w","w","w","x","w","w","w","w","x",2,null,null,"w","w","w","w","w","w","w","x","w","w",1,null,null,"x","w","x","w","w","w","w","w","q","w",3]
[null,null,"w","w","r","l","w","w","w","w","w","w",2,null,null,"w","w","w","x","x","x","x","w","k","w",5,null,null,"k","w","w","w","x",3,3,"w","w","w",4,null,null,"w",3,"w","w","w","w","w",3,"w","w",2,null,null,"x","w","x","w","w","w","w","w","w","w",2,null,null,"k","w","w","w","w","w","w","w","w","x",2,null,null,"w","w","x","x","w","w","w","x","w","x",4,null,null,"x","w","w","w","w","k","w","w","x","w",3]
[null,{"$f":"SUM(C49:L49)","v":20},4,0,5,1,0,1,0,6,1,2,{"$f":"SUM(M39:M48)","v":20},null,{"$f":"SUM(P49:Y49)","v":20},2,0,2,1,5,2,3,1,3,1,{"$f":"SUM(Z39:Z48)","v":20},null,{"$f":"SUM(AC49:AL49)","v":20},4,1,4,0,3,4,1,2,0,1,{"$f":"SUM(AM39:AM48)","v":20},null,{"$f":"SUM(AP49:AY49)","v":20},2,3,0,1,3,2,1,4,0,4,{"$f":"SUM(AZ39:AZ48)","v":20},null,{"$f":"SUM(BC49:BL49)","v":20},1,4,3,1,0,4,0,4,2,1,{"$f":"SUM(BM39:BM48)","v":20},null,{"$f":"SUM(BP49:BY49)","v":20},2,4,0,0,3,1,3,0,0,7,{"$f":"SUM(BZ39:BZ48)","v":20},null,{"$f":"SUM(CC49:CL49)","v":20},0,0,5,3,2,2,0,5,1,2,{"$f":"SUM(CM39:CM48)","v":20},null,{"$f":"SUM(CP49:CY49)","v":20},5,2,3,0,2,2,1,1,3,1,{"$f":"SUM(CZ39:CZ48)","v":20}]
[]
[null,null,"Tagi, 07.06.21",null,null,null,null,null,null,null,null,null,null,null,null,"Migros-Magazin, 07.06.21",null,null,null,null,null,null,null,null,null,null,null,null,"Tagi, 09.06.21",null,null,null,null,null,null,null,null,null,null,null,null,"Tagi, 10.06.21",null,null,null,null,null,null,null,null,null,null,null,null,"Tagi, 11.06.21",null,null,null,null,null,null,null,null,null,null,null,null,"Tagi, 12.06.21",null,null,null,null,null,null,null,null,null,null,null,null,"Tagi, 14.06.21",null,null,null,null,null,null,null,null,null,null,null,null,"Migros-Magazin, 14.06.21"]
[null,17,null,null,null,null,null,null,null,null,null,null,1,null,18,null,null,null,null,null,null,null,null,null,null,1,null,19,null,null,null,null,"k",null,null,null,null,null,3,null,20,null,null,null,null,null,null,null,null,null,"u",3,null,21,null,null,null,null,"u",null,null,null,null,null,1,null,22,"w",null,null,null,null,null,null,null,null,null,1,null,23,null,null,"u",null,null,null,null,null,null,null,3,null,24,null,null,null,null,null,null,null,null,null,null,1]
[null,"Tagi, 07.06.21",null,null,null,null,null,null,null,"l",null,null,4,null,"Migros-Magazin, 07.06.21",null,null,null,null,null,null,null,null,null,null,1,null,"Tagi, 09.06.21",null,null,null,null,null,null,null,null,null,null,3,null,"Tagi, 10.06.21",null,null,null,null,null,null,null,null,null,null,2,null,"Tagi, 11.06.21",null,null,null,null,null,null,null,null,null,null,1,null,"Tagi, 12.06.21",null,null,null,null,null,null,null,null,null,null,0,null,"Tagi, 14.06.21",null,null,null,null,null,null,null,null,null,null,1,null,"Migros-Magazin, 14.06.21",null,null,null,null,null,null,null,null,null,null,2]
[null,null,null,null,null,null,null,null,null,null,null,null,2,null,null,null,null,null,null,null,null,null,null,null,null,0,null,null,null,null,null,null,null,null,null,null,null,null,2,null,null,null,null,null,null,null,null,null,null,null,null,2,null,null,null,null,null,null,null,null,null,null,null,null,5,null,null,null,null,null,null,null,null,null,null,"w",null,4,null,null,null,null,null,null,null,null,null,null,null,null,4,null,null,null,null,null,null,null,null,null,null,null,null,1]
[null,null,null,null,null,null,null,null,null,null,null,null,0,null,null,null,null,null,null,null,null,null,null,null,null,2,null,null,null,null,null,null,null,null,null,null,null,null,1,null,null,null,null,null,null,null,null,null,null,null,null,2,null,null,null,null,null,null,null,null,null,null,null,null,0,null,null,null,null,null,null,null,"u",null,null,null,null,1,null,null,null,null,null,null,null,null,null,null,null,null,0,null,null,null,null,"o",null,null,null,null,null,"k",null,4]
[null,null,null,null,null,null,null,null,null,null,null,null,3,null,null,"w",null,null,null,null,null,null,null,null,null,2,null,null,null,null,"w",null,null,null,null,null,null,null,2,null,null,"u",null,null,null,null,null,null,null,null,null,1,null,null,null,null,null,null,null,null,null,null,null,null,0,null,null,null,null,null,null,null,null,null,null,null,null,2,null,null,null,"r",null,null,null,null,null,null,null,null,4,null,null,null,null,null,null,null,null,null,null,null,null,1]
[null,null,null,null,null,null,null,null,null,"k",null,null,2,null,null,null,null,null,null,null,null,null,null,null,null,6,null,null,null,null,null,null,null,null,null,null,"o",null,1,null,null,null,null,null,null,null,null,null,null,null,null,1,null,null,null,null,null,null,null,null,null,null,null,null,6,null,null,null,null,null,null,null,null,null,null,null,null,0,null,null,null,null,null,null,null,null,null,null,null,null,0,null,null,null,null,null,null,null,null,null,null,null,null,2]
[null,null,null,null,null,null,null,null,null,null,null,null,0,null,null,null,null,null,null,null,null,null,null,null,null,2,null,null,null,null,null,null,null,null,null,null,null,null,3,null,null,null,null,null,null,null,null,null,null,null,null,4,null,null,null,null,null,null,null,null,null,null,null,null,2,null,null,"k",null,null,null,null,null,null,null,null,null,4,null,null,null,null,null,null,null,null,null,null,null,null,1,null,null,null,"o",null,null,null,null,null,null,null,null,1]
[null,null,null,null,null,null,null,"k",null,null,null,null,5,null,null,"w",null,null,null,null,null,null,null,null,null,3,null,null,null,null,null,null,null,null,null,null,null,null,3,null,null,null,null,null,null,null,null,null,null,null,null,1,null,null,null,null,null,null,null,"l",null,null,null,null,2,null,null,null,null,null,null,null,null,null,null,null,null,3,null,null,null,null,null,null,null,null,null,null,null,null,1,null,null,null,null,null,null,null,null,null,null,null,null,5]
[null,null,null,"q",null,null,null,null,null,null,null,null,1,null,null,null,null,null,null,null,null,null,"q",null,null,1,null,null,null,null,null,null,null,null,null,null,null,null,1,null,null,"o",null,null,null,null,null,null,"l",null,null,3,null,null,null,null,null,null,null,null,null,null,null,null,0,null,null,null,null,null,null,null,null,null,null,null,null,2,null,null,null,null,null,null,null,null,null,null,null,null,3,null,null,null,null,null,null,null,null,null,null,null,null,0]
[null,null,null,null,null,null,null,null,null,null,null,null,2,null,null,null,null,null,null,null,null,null,null,null,null,2,null,null,null,null,null,null,null,null,null,null,null,null,1,null,null,null,null,null,null,null,null,null,null,null,null,1,null,null,null,null,null,null,null,null,null,"k",null,null,3,null,null,null,null,null,null,null,null,null,null,null,null,3,null,null,null,"r",null,null,null,null,"o",null,null,null,3,null,null,null,null,"w",null,null,null,null,null,null,null,3]
[null,{"$f":"SUM(C62:L62)","v":20},3,5,1,1,2,2,1,3,1,1,{"$f":"SUM(M52:M61)","v":20},null,{"$f":"SUM(P62:Y62)","v":20},5,0,4,0,1,0,3,3,2,2,{"$f":"SUM(Z52:Z61)","v":20},null,{"$f":"SUM(AC62:AL62)","v":20},2,2,2,0,1,3,0,1,5,4,{"$f":"SUM(AM52:AM61)","v":20},null,{"$f":"SUM(AP62:AY62)","v":20},4,0,0,6,0,0,4,2,1,3,{"$f":"SUM(AZ52:AZ61)","v":20},null,{"$f":"SUM(BC62:BL62)","v":20},4,0,1,1,5,2,1,4,1,1,{"$f":"SUM(BM52:BM61)","v":20},null,{"$f":"SUM(BP62:BY62)","v":20},3,2,5,0,0,2,3,0,3,2,{"$f":"SUM(BZ52:BZ61)","v":20},null,{"$f":"SUM(CC62:CL62)","v":20},1,2,4,2,0,1,4,3,2,1,{"$f":"SUM(CM52:CM61)","v":20},null,{"$f":"SUM(CP62:CY62)","v":20},2,3,3,0,4,0,1,2,2,3,{"$f":"SUM(CZ52:CZ61)","v":20}]
[null,null,"Lösung",null,null,null,null,null,null,null,null,null,null,null,null,"Lösung",null,null,null,null,null,null,null,null,null,null,null,null,"Lösung",null,null,null,null,null,null,null,null,null,null,null,null,"Lösung",null,null,null,null,null,null,null,null,null,null,null,null,"Lösung",null,null,null,null,null,null,null,null,null,null,null,null,"Lösung",null,null,null,null,null,null,null,null,null,null,null,null,"Lösung",null,null,null,null,null,null,null,null,null,null,null,null,"Lösung"]
[null,17,"w","x","w","w","w","w","w","w","w","w",1,null,18,2,"w","w","w","w","w","w","w","w","w",1,null,19,"w","w","w","w","k","w","w","w","x","x",3,null,20,"w","w","w","x","w","w","x","w","w","u",3,null,21,"w","w","w","w","u","w","w","w","w","w",1,null,22,"w","x","w","w","w","w","w","w","w","w",1,null,23,"x","w","u","w","w","w","w","x","w","w",3,null,24,"w","w","w","w","w","w","w","w","w",2,1]
[null,"Tagi, 07.06.21","w","w","w","w","x","x","x","x","w","w",4,null,"Migros-Magazin, 07.06.21",2,"w","w","w","w","w","w","w","w","w",1,null,"Tagi, 09.06.21","x","x","x","w","w","w","w","w","w","w",3,null,"Tagi, 10.06.21","w","w","w","x","w","w","w","w","w",3,2,null,"Tagi, 11.06.21","w","w","w","w","x","w","w","w","w","w",1,null,"Tagi, 12.06.21","w","w","w","w","w","w","w","w","w","w",0,null,"Tagi, 14.06.21","w","w","x","w","w","w","w","w","w","w",1,null,"Migros-Magazin, 14.06.21","w","w",3,"w","w","w","w","w","w",2,2]
[null,null,"x","x","w","w","w","w","w","w","w","w",2,null,null,"w","w","w","w","w","w","w","w","w","w",0,null,null,"w","w","w","w","w","x","w","w",4,"w",2,null,null,"w","w","w","x","w","w","w","w","w",3,2,null,null,"x","w","w","w","x","w","x","x","x","w",5,null,null,"x","x","x","w","w","w","w","w","w","x",4,null,null,"w","w","w","w","w","x","x","x","x","w",4,null,null,"w","w",3,"w","w","w","w","w","w","w",1]
[null,null,"w","w","w","w","w","w","w","w","w","w",0,null,null,"w","w","w","w","w","w",3,"w","x","w",2,null,null,"w","w","w","w","w","w","w","w",4,"w",1,null,null,"w","w","w","x","w","w","x","w","w","w",2,null,null,"w","w","w","w","w","w","w","w","w","w",0,null,null,"w","w","w","w","w","u","w","w","w","w",1,null,null,"w","w","w","w","w","w","w","w","w","w",0,null,null,"x","w","o","w",3,"w","w","w","k","w",4]
[null,null,"x","w","x",2,"w","w","w","w","w","w",3,null,null,"w","w","x","w","w","w",3,"w","w","w",2,null,null,"x","w","w","w","w","w","w","w","x","w",2,null,null,"u","w","w","w","w","w","w","w","w","w",1,null,null,"w","w","w","w","w","w","w","w","w","w",0,null,null,"x","w","w","w","w","o","w","w","w","w",2,null,null,"w",3,3,3,"w","w","w","x","w","w",4,null,null,"w","w","w","w",3,"w","w","w","w","w",1]
[null,null,"x","w","w","w","w","w","w","k","w","w",2,null,null,"x","w","x","w","x","w",3,"w","x","x",6,null,null,"w","w","w","w","w","w","w","w","o","w",1,null,null,"x","w","w","w","w","w","w","w","w","w",1,null,null,"x","w","x","x","x","x","w","x","w","w",6,null,null,"w","w","w","w","w","w","w","w","w","w",0,null,null,"w","w","w","w","w","w","w","w","w","w",0,null,null,"w","x","w","w",3,"w","w","w","w","w",2]
[null,null,"w","w","w","w","w","w","w","w","w","w",0,null,null,"x","w","x","w","w","w","w","w","w","w",2,null,null,"w",2,"x","w","w",2,"w","w","w","w",3,null,null,"w","w","w","x","w","w","x",3,3,"w",4,null,null,"x","w","w","w","w","w","w","x","w","w",2,null,null,"k","w",4,"w","w","w","x","w",2,"w",4,null,null,"w","w","w","x","w","w","w","w","w","w",1,null,null,"w","o","w","w","w","w","w","w","w","w",1]
[null,null,"w","x","w","w","w","k","w",3,3,3,5,null,null,"w","w","x","w","w","w","w","x","w","x",3,null,null,"w","w","w","w","w",2,"w","x","w","x",3,null,null,"x","w","w","w","w","w","w","w","w","w",1,null,null,"w","w","w","w","r","l","w","w","w","w",2,null,null,"w","w",4,"w","w","w","x","w",2,"w",3,null,null,"w","w","w","w","w","w",3,"w","w","w",1,null,null,"w","w","w","w","x","w","x","x","x","x",5]
[null,null,"w","q","w","w","w","w","w","w","w","w",1,null,null,"w","w","w","w","w","w","w","q","w","w",1,null,null,"w","w","w","w","w","w","w","w","w","x",1,null,null,"o","w","w","w","w","w","x","l","w","w",3,null,null,"w","w","w","w","w","w","w","w","w","w",0,null,null,"w","w",4,"w","w","w","x","w","w","w",2,null,null,"w","w","w","w","w","w",3,"w","x","x",3,null,null,"w","w","w","w","w","w","w","w","w","w",0]
[null,null,"w","x","w","w","x","w","w","w","w","w",2,null,null,"x","w","w","w","w","w","w","x","w","w",2,null,null,"w","w","w","w","w","w","w","w","w","x",1,null,null,"w","w","w","x","w","w","w","w","w","w",1,null,null,"x","w","w","w","w","w","w","k","w","x",3,null,null,"w","w",4,"w","w","w","w","w",2,2,3,null,null,"w","r","x","w","w","w","o","w","w","w",3,null,null,2,2,"w","w","w","w","w","x","w","w",3]
[null,{"$f":"SUM(C74:L74)","v":20},3,5,1,1,2,2,1,3,1,1,{"$f":"SUM(M64:M73)","v":20},null,{"$f":"SUM(P74:Y74)","v":20},5,0,4,0,1,0,3,3,2,2,{"$f":"SUM(Z64:Z73)","v":20},null,{"$f":"SUM(AC74:AL74)","v":20},2,2,2,0,1,3,0,1,5,4,{"$f":"SUM(AM64:AM73)","v":20},null,{"$f":"SUM(AP74:AY74)","v":20},4,0,0,6,0,0,4,2,1,3,{"$f":"SUM(AZ64:AZ73)","v":20},null,{"$f":"SUM(BC74:BL74)","v":20},4,0,1,1,5,2,1,4,1,1,{"$f":"SUM(BM64:BM73)","v":20},null,{"$f":"SUM(BP74:BY74)","v":20},3,2,5,0,0,2,3,0,3,2,{"$f":"SUM(BZ64:BZ73)","v":20},null,{"$f":"SUM(CC74:CL74)","v":20},1,2,4,2,0,1,4,3,2,1,{"$f":"SUM(CM64:CM73)","v":20},null,{"$f":"SUM(CP74:CY74)","v":20},2,3,3,0,4,0,1,2,2,3,{"$f":"SUM(CZ64:CZ73)","v":20}]
[]
[null,null,"Tagi, 15.06.21",null,null,null,null,null,null,null,null,null,null,null,null,"Tagi, 16.06.21",null,null,null,null,null,null,null,null,null,null,null,null,"Tagi, 17.06.21",null,null,null,null,null,null,null,null,null,null,null,null,"Tagi, 18.06.21",null,null,null,null,null,null,null,null,null,null,null,null,"Beobachter, 18.06.21",null,null,null,null,null,null,null,null,null,null,null,null,"Tagi, 19.06.21",null,null,null,null,null,null,null,null,null,null,null,null,"Tagi, 21.06.21",null,null,null,null,null,null,null,null,null,null,null,null,"Tagi, 22.06.21"]
[null,25,null,null,null,null,null,"k",null,null,null,null,2,null,26,null,null,null,null,null,null,null,null,null,null,3,null,27,null,null,null,null,null,null,null,null,null,null,6,null,28,"k",null,null,null,null,null,null,null,null,null,2,null,29,null,null,null,null,null,null,null,null,null,null,0,null,30,null,null,null,null,null,null,null,null,null,null,2,null,31,"k",null,null,null,null,null,null,null,null,null,2,null,32,null,null,null,null,null,null,null,null,null,null,3]
[null,"Tagi, 15.06.21",null,null,null,null,null,null,null,"o",null,null,1,null,"Tagi, 16.06.21",null,null,null,null,null,null,null,"k",null,null,4,null,"Tagi, 17.06.21",null,null,null,null,null,null,null,null,null,null,1,null,"Tagi, 18.06.21",null,null,null,null,null,null,null,null,null,null,1,null,"Beobachter, 18.06.21",null,null,null,null,null,null,null,null,null,null,0,null,"Tagi, 19.06.21",null,null,null,null,"q",null,null,null,null,null,3,null,"Tagi, 21.06.21",null,null,null,null,null,null,null,null,null,null,0,null,"Tagi, 22.06.21",null,null,null,null,"w",null,null,null,null,null,2]
[null,null,null,null,null,null,null,null,null,null,null,null,2,null,null,null,null,null,null,null,null,null,null,null,null,1,null,null,null,null,null,null,null,null,"r",null,null,null,2,null,null,null,null,null,null,null,null,null,null,null,null,4,null,null,null,null,"k",null,null,null,null,null,null,null,2,null,null,null,null,null,null,null,null,null,null,null,null,1,null,null,null,null,null,null,null,null,null,null,null,null,2,null,null,null,null,null,null,null,null,null,null,null,null,3]
[null,null,null,null,null,"u",null,null,null,null,null,null,1,null,null,null,null,null,null,null,null,null,null,null,null,1,null,null,null,null,null,null,null,null,null,null,null,null,1,null,null,null,null,null,null,null,null,null,null,null,null,1,null,null,null,null,null,null,null,null,null,null,null,null,4,null,null,null,null,null,null,null,null,null,null,null,null,1,null,null,null,null,null,null,null,null,null,null,null,null,1,null,null,null,null,null,null,null,null,"q",null,null,null,2]
[null,null,null,null,null,null,null,null,null,null,null,null,4,null,null,null,"k",null,null,null,null,null,null,null,null,1,null,null,null,null,null,null,null,null,null,null,null,null,0,null,null,null,null,null,"k",null,null,null,null,null,null,2,null,null,null,null,null,null,null,null,null,null,null,null,0,null,null,null,null,null,null,null,null,null,null,null,null,3,null,null,null,null,null,null,null,null,"k",null,null,null,2,null,null,null,null,"k",null,null,null,null,null,null,null,3]
[null,null,null,null,null,null,null,null,null,null,null,null,2,null,null,null,null,null,null,null,null,null,null,null,null,0,null,null,null,null,null,null,null,null,null,null,"k",null,5,null,null,null,null,null,null,null,null,null,"k",null,null,3,null,null,null,null,null,null,null,null,null,"q",null,null,5,null,null,null,null,null,null,null,null,null,null,null,null,1,null,null,null,null,null,null,null,null,null,null,null,null,1,null,null,null,null,null,null,null,null,null,null,null,null,1]
[null,null,null,null,null,null,null,null,null,null,null,null,1,null,null,null,null,null,null,null,null,null,null,null,null,3,null,null,null,null,null,null,null,null,null,null,null,null,0,null,null,null,null,null,null,null,null,null,null,null,null,2,null,null,null,null,null,null,null,null,null,null,null,null,0,null,null,null,null,null,null,null,null,null,null,null,null,0,null,null,null,null,null,null,null,null,null,null,null,null,4,null,null,null,null,null,null,null,null,null,null,null,null,2]
[null,null,null,null,null,null,null,null,null,null,null,null,0,null,null,"k",null,null,null,null,null,null,null,null,null,2,null,null,null,null,null,null,null,null,null,null,null,null,0,null,null,null,null,null,null,null,null,null,null,null,null,3,null,null,null,null,null,null,null,null,null,null,null,null,3,null,null,"k",null,null,null,"r",null,null,null,null,null,5,null,null,null,null,null,null,null,null,"k",null,null,null,1,null,null,null,null,null,null,null,null,null,null,null,null,0]
[null,null,null,null,null,null,null,null,null,null,"q",null,4,null,null,null,null,null,null,null,null,null,null,null,null,4,null,null,null,null,null,null,null,null,null,null,null,null,1,null,null,null,null,null,null,null,null,null,null,null,null,0,null,null,null,null,null,null,null,null,null,null,null,null,2,null,null,null,null,null,null,null,null,null,null,null,null,1,null,null,null,null,null,null,null,null,null,null,null,null,3,null,null,null,null,null,null,null,"u",null,null,null,null,1]
[null,null,null,null,null,null,null,null,null,null,null,null,3,null,null,null,null,null,null,null,null,null,null,null,null,1,null,null,null,"k",null,null,null,null,null,null,null,null,4,null,null,null,null,null,null,null,null,null,null,null,null,2,null,null,null,null,null,null,null,null,null,null,null,null,4,null,null,null,null,null,null,null,null,"l",null,null,null,3,null,null,null,null,null,null,null,null,null,null,null,null,4,null,null,null,null,null,null,null,null,null,null,null,null,3]
[null,{"$f":"SUM(C87:L87)","v":20},1,1,1,5,0,3,1,3,3,2,{"$f":"SUM(M77:M86)","v":20},null,{"$f":"SUM(P87:Y87)","v":20},4,1,4,2,3,0,0,1,0,5,{"$f":"SUM(Z77:Z86)","v":20},null,{"$f":"SUM(AC87:AL87)","v":20},1,2,4,2,2,2,2,1,2,2,{"$f":"SUM(AM77:AM86)","v":20},null,{"$f":"SUM(AP87:AY87)","v":20},3,1,0,3,0,3,2,4,2,2,{"$f":"SUM(AZ77:AZ86)","v":20},null,{"$f":"SUM(BC87:BL87)","v":20},0,0,1,3,3,4,1,3,1,4,{"$f":"SUM(BM77:BM86)","v":20},null,{"$f":"SUM(BP87:BY87)","v":20},2,2,0,3,2,3,3,1,0,4,{"$f":"SUM(BZ77:BZ86)","v":20},null,{"$f":"SUM(CC87:CL87)","v":20},2,3,3,0,1,1,3,0,4,3,{"$f":"SUM(CM77:CM86)","v":20},null,{"$f":"SUM(CP87:CY87)","v":20},3,0,1,0,4,2,5,3,0,2,{"$f":"SUM(CZ77:CZ86)","v":20}]
[null,null,"Lösung",null,null,null,null,null,null,null,null,null,null,null,null,"Lösung",null,null,null,null,null,null,null,null,null,null,null,null,"Lösung",null,null,null,null,null,null,null,null,null,null,null,null,"Lösung",null,null,null,null,null,null,null,null,null,null,null,null,"Lösung",null,null,null,null,null,null,null,null,null,null,null,null,"Lösung",null,null,null,null,null,null,null,null,null,null,null,null,"Lösung",null,null,null,null,null,null,null,null,null,null,null,null,"Lösung"]
[null,25,"w","w","w","w","w","k","w","x","w","w",2,null,26,"x","w","x","w",2,"w","w","w","w","w",3,null,27,"w","w","x","w","x","x","x","w","x","x",6,null,28,"k","w","w","x","w","w","w","w","w","w",2,null,29,"w","w","w","w","w","w","w","w","w","w",0,null,30,"x","x","w","w","w","w","w","w","w","w",2,null,31,"k","w","w","w","w","w","w","w","w","x",2,null,32,3,"w","w","w","w","w","x","x","w","w",3]
[null,"Tagi, 15.06.21","w","w","w","w","w","w","w","o","w","w",1,null,"Tagi, 16.06.21","x","w","x","w",2,"w","w","k","w","w",4,null,"Tagi, 17.06.21","w","w","x","w","w","w","w","w","w","w",1,null,"Tagi, 18.06.21","w","w","w","x","w","w","w","w","w","w",1,null,"Beobachter, 18.06.21","w","w","w","w","w","w","w","w","w","w",0,null,"Tagi, 19.06.21","w","w","w","x","q","x","w","w","w","w",3,null,"Tagi, 21.06.21","w","w","w","w","w","w","w","w","w","w",0,null,"Tagi, 22.06.21",3,"w","w","w","w","w","w","w","w","x",2]
[null,null,"x","w","w","w","w","w","w","w","w","x",2,null,null,"x","w","w","w","w","w","w","w","w","w",1,null,null,"w","w","w","w","w","w","r","l","w","w",2,null,null,"w","w","w","w","w","w","x","x","x","x",4,null,null,"w","w","k","w","w","w","w","w","w","x",2,null,null,"w","w","w","w","w","w","w","w","w","x",1,null,null,"w","x","x","w","w","w","w","w","w","w",2,null,null,3,"w","w","w",4,"w","x","w","w","w",3]
[null,null,"w","w","w","x","w","w","w","w","w","w",1,null,null,"w","w","w","w","w","w","w","w","w","x",1,null,null,"w","w","x","w","w","w","w","w","w","w",1,null,null,"w","x","w","w","w","w","w","w","w","w",1,null,null,"w","w","w","w","x","x","w","x","w","x",4,null,null,"w","w","w","w","w","w","w","w","w","x",1,null,null,"w","w","w","w","w","w","w","w","x","w",1,null,null,"w","w","w","w",4,"w","q","w","w","w",2]
[null,null,"w","w","w","x","w",2,2,"w","x","w",4,null,null,"w","k","w","w","w","w","w","w","w","w",1,null,null,"w","w","w","w","w","w","w","w","w","w",0,null,null,"w","w","w","k","w",3,"w","w","w","w",2,null,null,"w","w","w","w","w","w","w","w","w","w",0,null,null,"w","w","w",2,"w","w","x","w","w","x",3,null,null,"w","w","w","w","w","w","k","w","x","w",2,null,null,"w","w","k","w",4,"w","x","w","w","w",3]
[null,null,"w","w","w","x","w","w","w","w","x","w",2,null,null,"w","w","w","w","w","w","w","w","w","w",0,null,null,"x","x","x","x","w","w","w","w","k","w",5,null,null,2,"w","w","w","w",3,"w","k","w","w",3,null,null,"w","w","w","x","w","x","x","x","x","w",5,null,null,"w","w","w",2,"w","w","w","w","w","w",1,null,null,"w","w","w","w","w","w","w","w","x","w",1,null,null,"w","w","w","w",4,"w","w","w","w","w",1]
[null,null,"w","w","w","x","w","w","w","w","w","w",1,null,null,"w","w","x",2,"w","w","w","w","w",4,3,null,null,"w","w","w","w","w","w","w","w","w","w",0,null,null,2,"w","w","w","w",3,"w","w","w","w",2,null,null,"w","w","w","w","w","w","w","w","w","w",0,null,null,"w","w","w","w","w","w","w","w","w","w",0,null,null,3,3,3,"w","w","w","w","w","x","w",4,null,null,"w","w","w","w","w","w","x","x","w","w",2]
[null,null,"w","w","w","w","w","w","w","w","w","w",0,null,null,"k","w","w","w","w","w","w","w","w",4,2,null,null,"w","w","w","w","w","w","w","w","w","w",0,null,null,"w","w","w","w","w","w","w",3,3,3,3,null,null,"w","w","w",3,3,3,"w","w","w","w",3,null,null,"k","w","w","w",4,4,4,4,"w","w",5,null,null,"w","w","w","w","w","w","k","w","w","w",1,null,null,"w","w","w","w","w","w","w","w","w","w",0]
[null,null,"w","w","w","w","w","x","w","x","q","x",4,null,null,"w","w","x","x","x","w","w","w","w",4,4,null,null,"w","w","w","w","w","w","w","w","w","x",1,null,null,"w","w","w","w","w","w","w","w","w","w",0,null,null,"w","w","w","w","w","w","w","x","w",2,2,null,null,"w","w","w","w","w","w","w","w","w","x",1,null,null,"w",2,2,"w","w","w","w","w","w","x",3,null,null,"w","w","w","w","w","u","w","w","w","w",1]
[null,null,"w",3,3,"x","w","w","w","w","w","w",3,null,null,"w","w","w","w","w","w","w","w","w",4,1,null,null,"w","k","w",3,3,3,"w","w","w","w",4,null,null,"w","w","w","w","w","w","x","x","w","w",2,null,null,"w","w","w",3,3,3,"w","w","w",2,4,null,null,"w","x","w","w","w","x","l","w","w","w",3,null,null,"w","w","w","w",3,3,3,"w","w","x",4,null,null,"w","w","w","w","w","o","w","x","w","x",3]
[null,{"$f":"SUM(C99:L99)","v":20},1,1,1,5,0,3,1,3,3,2,{"$f":"SUM(M89:M98)","v":20},null,{"$f":"SUM(P99:Y99)","v":20},4,1,4,2,3,0,0,1,0,5,{"$f":"SUM(Z89:Z98)","v":20},null,{"$f":"SUM(AC99:AL99)","v":20},1,2,4,2,2,2,2,1,2,2,{"$f":"SUM(AM89:AM98)","v":20},null,{"$f":"SUM(AP99:AY99)","v":20},3,1,0,3,0,3,2,4,2,2,{"$f":"SUM(AZ89:AZ98)","v":20},null,{"$f":"SUM(BC99:BL99)","v":20},0,0,1,3,3,4,1,3,1,4,{"$f":"SUM(BM89:BM98)","v":20},null,{"$f":"SUM(BP99:BY99)","v":20},2,2,0,3,2,3,3,1,0,4,{"$f":"SUM(BZ89:BZ98)","v":20},null,{"$f":"SUM(CC99:CL99)","v":20},2,3,3,0,1,1,3,0,4,3,{"$f":"SUM(CM89:CM98)","v":20},null,{"$f":"SUM(CP99:CY99)","v":20},3,0,1,0,4,2,5,3,0,2,{"$f":"SUM(CZ89:CZ98)","v":20}]
[]
[null,null,"Tagi, 23.06.21",null,null,null,null,null,null,null,null,null,null,null,null,"Tagi, 25.06.21",null,null,null,null,null,null,null,null,null,null,null,null,"Tagi, 26.06.21",null,null,null,null,null,null,null,null,null,null,null,null,"Tagi, 28.06.21",null,null,null,null,null,null,null,null,null,null,null,null,"Migros-Magazin, 28.06.21",null,null,null,null,null,null,null,null,null,null,null,null,"Tagi, 29.06.21",null,null,null,null,null,null,null,null,null,null,null,null,"Tagi, 30.06.21",null,null,null,null,null,null,null,null,null,null,null,null,"Tagi, 01.07.21"]
[null,33,null,null,null,null,null,null,null,null,null,null,3,null,34,null,null,"l",null,null,null,null,null,null,null,4,null,35,null,null,null,null,null,null,"k",null,null,null,1,null,36,null,null,null,null,null,null,null,null,null,null,4,null,37,null,null,null,null,null,null,null,null,null,null,2,null,38,null,null,null,null,null,null,null,null,null,null,1,null,39,null,null,null,null,"w",null,null,null,null,null,3,null,40,null,"u",null,null,null,null,null,null,null,null,1]
[null,"Tagi, 23.06.21",null,null,null,null,null,null,null,"w",null,null,1,null,"Tagi, 25.06.21",null,null,null,null,null,null,null,null,null,null,0,null,"Tagi, 26.06.21",null,null,null,null,null,null,null,null,null,null,0,null,"Tagi, 28.06.21",null,null,null,"q",null,null,null,null,null,null,3,null,"Migros-Magazin, 28.06.21",null,null,null,null,null,null,null,null,null,null,0,null,"Tagi, 29.06.21",null,null,null,null,null,null,null,"w",null,null,6,null,"Tagi, 30.06.21",null,null,null,null,null,null,null,null,null,null,4,null,"Tagi, 01.07.21",null,null,null,null,null,null,null,null,null,null,7]
[null,null,null,null,null,null,null,null,null,null,null,null,1,null,null,null,null,null,null,null,null,null,null,null,null,2,null,null,null,null,null,null,null,null,null,null,null,null,3,null,null,null,null,null,null,null,null,null,null,null,null,2,null,null,null,null,"u",null,null,null,null,null,null,null,2,null,null,null,null,null,null,null,null,null,null,null,null,0,null,null,null,null,null,null,null,null,null,null,null,null,0,null,null,null,null,null,null,null,null,null,null,null,null,1]
[null,null,null,null,null,null,null,null,null,null,null,null,2,null,null,null,null,null,null,null,null,null,null,null,null,2,null,null,null,null,null,null,null,null,null,null,null,null,2,null,null,null,null,null,null,null,null,null,null,null,null,0,null,null,null,null,null,null,null,null,null,null,null,null,5,null,null,null,null,null,null,null,null,null,null,null,null,0,null,null,null,null,null,null,null,null,null,null,null,null,3,null,null,null,null,null,null,null,null,null,null,null,null,1]
[null,null,null,null,null,null,null,null,null,null,null,null,0,null,null,null,null,null,null,null,null,null,null,null,null,2,null,null,null,null,null,null,null,null,null,null,null,null,5,null,null,null,null,null,null,null,null,null,null,null,null,0,null,null,null,null,null,null,null,null,null,null,null,null,3,null,null,"u",null,null,null,null,null,null,null,null,null,3,null,null,null,null,null,null,null,null,null,"w",null,null,1,null,null,null,null,null,null,null,null,null,null,null,null,1]
[null,null,null,"w",null,null,null,null,"r",null,null,null,3,null,null,null,null,null,null,null,null,null,null,null,null,2,null,null,null,null,null,null,null,null,null,null,null,null,0,null,null,null,null,null,null,null,"u",null,null,"r",null,3,null,null,null,"w",null,null,null,null,null,null,null,null,2,null,null,null,null,null,null,null,null,null,null,null,null,2,null,null,null,null,null,null,null,null,null,null,null,null,0,null,null,null,"k",null,null,null,null,null,null,"u",null,2]
[null,null,null,null,null,null,null,null,null,null,null,null,1,null,null,null,null,null,null,"r",null,null,null,null,null,2,null,null,null,null,null,null,null,null,"l",null,null,null,3,null,null,null,null,null,null,null,null,null,null,null,null,1,null,null,null,null,null,null,null,null,"w",null,null,null,2,null,null,null,null,null,null,null,null,null,null,null,null,4,null,null,null,null,null,null,null,null,null,null,null,null,0,null,null,null,null,null,null,null,null,null,null,null,null,1]
[null,null,null,null,null,null,null,null,null,null,null,null,7,null,null,null,null,null,null,null,null,null,null,null,null,1,null,null,null,null,null,null,null,null,null,null,null,null,0,null,null,null,null,null,null,null,null,null,null,null,null,4,null,null,null,null,null,null,null,null,null,null,null,null,0,null,null,null,null,null,null,null,null,null,null,null,null,0,null,null,"k",null,null,null,null,null,null,null,null,null,4,null,null,null,null,null,null,null,null,"l",null,null,null,5]
[null,null,null,null,null,null,null,null,null,null,null,null,1,null,null,null,null,null,null,"r",null,null,null,null,null,3,null,null,null,null,null,null,null,null,null,null,null,null,1,null,null,null,null,null,null,null,null,null,null,null,null,0,null,null,null,null,null,null,null,null,null,null,null,null,2,null,null,null,null,null,null,null,null,null,null,null,null,2,null,null,null,null,null,null,null,null,null,null,"o",null,4,null,null,null,null,null,null,null,null,null,null,null,null,0]
[null,null,null,null,null,null,null,"w",null,null,null,null,1,null,null,null,null,null,null,null,null,null,null,null,null,2,null,null,null,null,null,null,null,null,null,"k",null,null,5,null,null,"k",null,null,null,null,null,null,null,null,null,3,null,null,"k",null,null,null,null,null,null,null,null,null,2,null,null,null,null,null,null,null,"w",null,null,null,null,2,null,null,null,null,null,null,null,null,null,null,null,null,1,null,null,null,null,null,null,null,null,null,null,null,null,1]
[null,{"$f":"SUM(C112:L112)","v":20},2,2,0,0,1,3,3,5,0,4,{"$f":"SUM(M102:M111)","v":20},null,{"$f":"SUM(P112:Y112)","v":20},1,1,1,3,2,2,2,4,3,1,{"$f":"SUM(Z102:Z111)","v":20},null,{"$f":"SUM(AC112:AL112)","v":20},2,0,2,3,2,2,2,1,0,6,{"$f":"SUM(AM102:AM111)","v":20},null,{"$f":"SUM(AP112:AY112)","v":20},3,1,1,2,2,3,1,1,4,2,{"$f":"SUM(AZ102:AZ111)","v":20},null,{"$f":"SUM(BC112:BL112)","v":20},4,2,4,1,1,0,4,0,1,3,{"$f":"SUM(BM102:BM111)","v":20},null,{"$f":"SUM(BP112:BY112)","v":20},3,2,1,1,0,6,0,3,1,3,{"$f":"SUM(BZ102:BZ111)","v":20},null,{"$f":"SUM(CC112:CL112)","v":20},1,1,2,0,4,1,4,2,3,2,{"$f":"SUM(CM102:CM111)","v":20},null,{"$f":"SUM(CP112:CY112)","v":20},1,5,2,2,2,2,1,1,3,1,{"$f":"SUM(CZ102:CZ111)","v":20}]
[null,null,"Lösung",null,null,null,null,null,null,null,null,null,null,null,null,"Lösung",null,null,null,null,null,null,null,null,null,null,null,null,"Lösung",null,null,null,null,null,null,null,null,null,null,null,null,"Lösung",null,null,null,null,null,null,null,null,null,null,null,null,"Lösung",null,null,null,null,null,null,null,null,null,null,null,null,"Lösung",null,null,null,null,null,null,null,null,null,null,null,null,"Lösung",null,null,null,null,null,null,null,null,null,null,null,null,"Lösung"]
[null,33,"w","w","w","w","w",3,3,3,"w","w",3,null,34,"w","x","l","w","w","w","x","w","x","w",4,null,35,"w","w","w","w","w","w","k","w","w","w",1,null,36,"w","w","w","w","w","w",4,4,4,4,4,null,37,"x","x","w","w","w","w","w","w","w","w",2,null,38,"w","w","w","w","w","x","w","w","w","w",1,null,39,"w","x","x","w","w","w","w","w","w","x",3,null,40,"w","x","w","w","w","w","w","w","w","w",1]
[null,"Tagi, 23.06.21","w","w","w","w","w","w","w","w","w","x",1,null,"Tagi, 25.06.21","w","w","w","w","w","w","w","w","w","w",0,null,"Tagi, 26.06.21","w","w","w","w","w","w","w","w","w","w",0,null,"Tagi, 28.06.21","w","w","x","q","x","w","w","w","w","w",3,null,"Migros-Magazin, 28.06.21","w","w","w","w","w","w","w","w","w","w",0,null,"Tagi, 29.06.21",4,4,4,4,"w","x","w","w","w","x",6,null,"Tagi, 30.06.21","w","w","w","w",4,4,4,4,"w","w",4,null,"Tagi, 01.07.21","w","x","w","x","x","x","w","x","x","x",7]
[null,null,"w","w","w","w","w","w","w",2,"w","w",1,null,null,"w","w","w","x","w","w","w",4,"w","w",2,null,null,"x","w","w","x","w","w","w","w","w","x",3,null,null,"x","w","w","w","w","w","w","w","x","w",2,null,null,"w","w",3,"w","w","w",4,"w","w","w",2,null,null,"w","w","w","w","w","w","w","w","w","w",0,null,null,"w","w","w","w","w","w","w","w","w","w",0,null,null,"w","x","w","w","w","w","w","w","w","w",1]
[null,null,"w","w","w","w","w","x","w",2,"w","w",2,null,null,"w","w","w","x","w","w","w",4,"w","w",2,null,null,"x","w","w","w","w","w","w","w","w","x",2,null,null,"w","w","w","w","w","w","w","w","w","w",0,null,null,"x","w",3,"w","x","w",4,"w","w","x",5,null,null,"w","w","w","w","w","w","w","w","w","w",0,null,null,"w","w","w","w","w","w","w","x","x","x",3,null,null,"w","x","w","w","w","w","w","w","w","w",1]
[null,null,"w","w","w","w","w","w","w","w","w","w",0,null,null,"w","w","w","x","w","w","w",4,"w","w",2,null,null,"w","w",4,4,4,4,"w","w","w","x",5,null,null,"w","w","w","w","w","w","w","w","w","w",0,null,null,"w","w",3,"w","w","w",4,"w","w",3,3,null,null,"u","w","w","w","w","x","w","w","w","x",3,null,null,"w","w","w","w","x","w","w","w","w","w",1,null,null,"w","w","w","w","x","w","w","w","w","w",1]
[null,null,"x","w","w","w","w","w","r","x","w","w",3,null,null,"x","w","w","w","w","w","w",4,"w","w",2,null,null,"w","w","w","w","w","w","w","w","w","w",0,null,null,"w","w","w","w","w",3,"w","w","r","x",3,null,null,"w","w","w","w","w","w",4,"w","w",3,2,null,null,"x","w","w","w","w","x","w","w","w","w",2,null,null,"w","w","w","w","w","w","w","w","w","w",0,null,null,"w","k","w","w","w","w","w","w","u","w",2]
[null,null,"w","w","w","w","w","w","w","w","w","x",1,null,null,"w","w","w","w","r","l","w","w","w","w",2,null,null,"w","w","w","w","w","x","l","w","w","x",3,null,null,"w","w","w","w","w",3,"w","w","w","w",1,null,null,"x","x","w","w","w","w","w","w","w","w",2,null,null,"w","w","w","w","w","x","w","x","x","x",4,null,null,"w","w","w","w","w","w","w","w","w","w",0,null,null,"w","w","w","w","w","w","w","w","x","w",1]
[null,null,"x","x","w","w","x","x","x","x","w","x",7,null,null,"w","w","w","w","w","w","w","w","x","w",1,null,null,"w","w","w","w","w","w","w","w","w","w",0,null,null,"x","x","w","w","w",3,"w","w","x","w",4,null,null,"w","w","w","w","w","w","w","w","w","w",0,null,null,"w","w","w","w","w","w","w","w","w","w",0,null,null,"k","w","w","w","x","w","x","w","x","w",4,null,null,"x","w","x","x","w","x","l","w","w","w",5]
[null,null,"w","w","w","w","w","w","w","w","w","x",1,null,null,"w","w","w","w","r","x","x","w","w","w",3,null,null,"w","w","w","w","w","w","w","w","w","x",1,null,null,"w","w","w","w","w","w","w","w","w","w",0,null,null,"w","w",2,2,"w","w","w","w","w","w",2,null,null,"w","w","w","w","w","x","w",2,"w","w",2,null,null,"w","w","x","w","x","w","x","w","o","w",4,null,null,"w","w","w","w","w","w","w","w","w","w",0]
[null,null,"w","x","w","w","w","w","w","w","w","w",1,null,null,"w","w","w","w","w","w","w","w",2,2,2,null,null,"w","w",3,3,3,"w","w","k","w","x",5,null,null,"k","w","w",2,2,"w","w","w","w","w",3,null,null,"k","w","w","w","w","w","w","w","x","w",2,null,null,"w","x","w","w","w","w","w",2,"w","w",2,null,null,"w","w","w","w","w","w","x","w","w","w",1,null,null,"w","w","x","w","w","w","w","w","w","w",1]
[null,{"$f":"SUM(C124:L124)","v":20},2,2,0,0,1,3,3,5,0,4,{"$f":"SUM(M114:M123)","v":20},null,{"$f":"SUM(P124:Y124)","v":20},1,1,1,3,2,2,2,4,3,1,{"$f":"SUM(Z114:Z123)","v":20},null,{"$f":"SUM(AC124:AL124)","v":20},2,0,2,3,2,2,2,1,0,6,{"$f":"SUM(AM114:AM123)","v":20},null,{"$f":"SUM(AP124:AY124)","v":20},3,1,1,2,2,3,1,1,4,2,{"$f":"SUM(AZ114:AZ123)","v":20},null,{"$f":"SUM(BC124:BL124)","v":20},4,2,4,1,1,0,4,0,1,3,{"$f":"SUM(BM114:BM123)","v":20},null,{"$f":"SUM(BP124:BY124)","v":20},3,2,1,1,0,6,0,3,1,3,{"$f":"SUM(BZ114:BZ123)","v":20},null,{"$f":"SUM(CC124:CL124)","v":20},1,1,2,0,4,1,4,2,3,2,{"$f":"SUM(CM114:CM123)","v":20},null,{"$f":"SUM(CP124:CY124)","v":20},1,5,2,2,2,2,1,1,3,1,{"$f":"SUM(CZ114:CZ123)","v":20}]
[]
[null,null,"Tagi, 02.07.21",null,null,null,null,null,null,null,null,null,null,null,null,"Tagi, 03.07.21",null,null,null,null,null,null,null,null,null,null,null,null,"Tagi, 05.07.21",null,null,null,null,null,null,null,null,null,null,null,null,"Migros-Magazin, 05.07.21",null,null,null,null,null,null,null,null,null,null,null,null,"Tagi, 06.07.21",null,null,null,null,null,null,null,null,null,null,null,null,"Tagi, 07.06.21",null,null,null,null,null,null,null,null,null,null,null,null,"Tagi, 08.01.21",null,null,null,null,null,null,null,null,null,null,null,null,"Tagi, 09.07.21"]
[null,41,null,null,null,null,"l",null,null,null,null,null,2,null,42,null,null,null,null,null,null,null,null,null,null,3,null,43,null,null,null,null,null,null,null,null,"k",null,3,null,44,"r",null,null,null,null,null,null,null,null,null,2,null,45,null,null,null,null,null,null,null,null,null,null,1,null,46,null,null,null,null,null,null,null,null,null,null,2,null,47,null,null,null,null,null,null,null,null,null,null,1,null,48,null,null,null,null,null,null,null,null,null,null,1]
[null,"Tagi, 02.07.21",null,"w",null,null,null,null,null,null,null,null,1,null,"Tagi, 03.07.21",null,null,null,null,null,null,null,null,null,null,0,null,"Tagi, 05.07.21",null,"k",null,null,null,null,null,null,null,null,1,null,"Migros-Magazin, 05.07.21",null,null,null,null,null,null,"k",null,null,null,2,null,"Tagi, 06.07.21",null,"o",null,null,null,null,null,null,null,null,4,null,"Tagi, 07.06.21",null,null,null,null,null,null,null,null,null,null,5,null,"Tagi, 08.01.21",null,null,null,null,null,null,null,null,null,null,1,null,"Tagi, 09.07.21",null,null,null,null,null,null,null,null,null,null,0]
[null,null,null,null,null,null,null,null,null,"k",null,null,1,null,null,null,null,null,null,null,null,null,"w",null,null,7,null,null,null,null,null,null,null,null,null,null,null,null,1,null,null,null,null,null,null,null,null,null,null,null,null,1,null,null,null,null,null,null,null,null,null,null,null,null,1,null,null,null,null,null,null,null,null,null,null,null,null,2,null,null,null,null,null,null,null,null,null,null,null,null,1,null,null,"k",null,null,null,null,null,null,null,null,null,3]
[null,null,null,null,null,null,null,null,null,null,null,null,0,null,null,null,null,null,null,null,null,null,null,null,null,0,null,null,null,null,null,null,"o",null,null,null,null,null,1,null,null,null,null,null,null,null,null,null,null,null,null,2,null,null,null,null,null,null,null,null,null,null,null,null,5,null,null,null,null,null,null,null,null,null,null,null,null,0,null,null,null,null,"o",null,null,null,null,null,null,null,4,null,null,null,null,null,null,null,null,null,null,null,null,4]
[null,null,null,null,null,null,null,null,null,null,null,null,3,null,null,null,null,null,null,null,null,null,null,null,null,0,null,null,null,null,null,null,null,null,null,null,null,null,0,null,null,null,null,null,null,null,null,null,null,null,null,3,null,null,null,null,null,null,null,null,null,null,null,null,1,null,null,null,null,null,null,null,null,null,null,null,null,0,null,null,null,null,null,null,null,null,null,null,null,null,1,null,null,null,null,null,null,null,null,null,null,null,null,3]
[null,null,null,null,null,null,null,null,null,null,null,null,3,null,null,null,null,null,null,null,null,null,null,null,null,2,null,null,null,null,null,null,null,null,null,null,null,null,3,null,null,null,null,null,null,null,null,"q",null,null,null,1,null,null,null,null,null,null,"u",null,null,null,null,null,1,null,null,null,null,null,null,null,null,null,null,null,null,2,null,null,null,null,null,null,null,null,null,null,null,null,1,null,null,null,null,null,null,null,null,null,null,null,null,1]
[null,null,null,null,null,null,null,null,null,"o",null,null,6,null,null,null,null,"o",null,null,null,null,null,null,null,1,null,null,null,null,null,null,null,null,null,null,null,null,0,null,null,null,null,null,null,null,null,null,null,null,null,5,null,null,null,null,null,null,null,null,null,null,null,null,3,null,null,"q",null,null,null,null,null,"r",null,null,null,3,null,null,null,null,null,null,null,null,"w",null,null,null,3,null,null,null,null,null,null,null,null,null,null,null,null,3]
[null,null,null,null,null,null,null,null,null,null,null,null,0,null,null,"u",null,null,null,null,null,null,null,null,null,4,null,null,null,null,null,null,null,"w",null,null,null,null,3,null,null,null,null,null,null,null,null,null,null,null,null,1,null,null,null,null,null,null,null,null,null,"o",null,null,2,null,null,null,null,null,"l",null,null,null,null,null,null,3,null,null,null,null,null,null,null,null,null,null,null,null,5,null,null,null,null,null,null,null,null,null,null,null,null,1]
[null,null,null,null,null,null,null,null,null,null,null,null,3,null,null,null,null,null,null,null,null,null,null,null,null,1,null,null,null,null,null,null,null,null,null,null,null,null,1,null,null,null,null,"u",null,null,null,null,null,null,null,1,null,null,null,null,null,null,null,null,null,null,null,null,0,null,null,null,null,null,null,null,null,null,null,null,null,1,null,null,null,null,null,null,null,null,"u",null,null,null,2,null,null,null,null,null,null,null,null,"r",null,null,null,3]
[null,null,null,null,null,null,null,null,null,null,null,null,1,null,null,null,null,null,null,null,null,null,"k",null,null,2,null,null,null,null,null,null,null,null,null,null,null,null,7,null,null,null,null,null,null,null,null,null,null,null,null,2,null,null,null,null,null,null,null,null,null,null,null,null,2,null,null,null,null,null,null,null,null,null,null,null,null,2,null,null,null,null,null,null,null,null,null,null,null,null,1,null,null,null,null,null,null,null,null,null,null,null,null,1]
[null,{"$f":"SUM(C137:L137)","v":20},1,2,1,3,1,5,0,4,0,3,{"$f":"SUM(M127:M136)","v":20},null,{"$f":"SUM(P137:Y137)","v":20},4,0,4,2,1,4,1,2,1,1,{"$f":"SUM(Z127:Z136)","v":20},null,{"$f":"SUM(AC137:AL137)","v":20},2,2,1,5,4,1,1,1,2,1,{"$f":"SUM(AM127:AM136)","v":20},null,{"$f":"SUM(AP137:AY137)","v":20},1,5,3,3,2,1,4,0,0,1,{"$f":"SUM(AZ127:AZ136)","v":20},null,{"$f":"SUM(BC137:BL137)","v":20},1,2,2,3,5,1,0,2,3,1,{"$f":"SUM(BM127:BM136)","v":20},null,{"$f":"SUM(BP137:BY137)","v":20},3,2,2,1,3,1,2,2,3,1,{"$f":"SUM(BZ127:BZ136)","v":20},null,{"$f":"SUM(CC137:CL137)","v":20},2,1,4,2,0,1,3,2,0,5,{"$f":"SUM(CM127:CM136)","v":20},null,{"$f":"SUM(CP137:CY137)","v":20},3,2,3,0,0,5,1,1,3,2,{"$f":"SUM(CZ127:CZ136)","v":20}]
[null,null,"Lösung",null,null,null,null,null,null,null,null,null,null,null,null,"Lösung",null,null,null,null,null,null,null,null,null,null,null,null,"Lösung",null,null,null,null,null,null,null,null,null,null,null,null,"Lösung",null,null,null,null,null,null,null,null,null,null,null,null,"Lösung",null,null,null,null,null,null,null,null,null,null,null,null,"Lösung",null,null,null,null,null,null,null,null,null,null,null,null,"Lösung",null,null,null,null,null,null,null,null,null,null,null,null,"Lösung"]
[null,41,"w","w","w","r","l","w","w","w","w","w",2,null,42,"w","w","x","x","w","x","w","w","w","w",3,null,43,"w","w","w","x","x","w","w","w","k","w",3,null,44,"r","l","w","w","w","w","w","w","w","w",2,null,45,"w","u","w","w","w","w","w","w","w","w",1,null,46,"w","x","w","w",3,"w","w","w","w","w",2,null,47,"x","w","w","w","w","w","w","w","w","w",1,null,48,"w","w","w","w","w","x","w","w","w","w",1]
[null,"Tagi, 02.07.21","w","w","w","w","w","w","w","w","w","x",1,null,"Tagi, 03.07.21","w","w","w","w","w","w","w","w","w","w",0,null,"Tagi, 05.07.21","w","k","w","w","w","w","w","w","w","w",1,null,"Migros-Magazin, 05.07.21","w","w","w","w","x","w","k","w","w","w",2,null,"Tagi, 06.07.21","w","o","w","x","x","w","w","w","x","w",4,null,"Tagi, 07.06.21","w","w","w","w",3,"w",4,4,4,4,5,null,"Tagi, 08.01.21","w","w",3,"w","w","w","w","w","w","w",1,null,"Tagi, 09.07.21","w","w","w","w","w","w","w","w","w","w",0]
[null,null,"w","w","w","w","w","w","w","k","w","w",1,null,null,"x","w","x","x","x","x","w","w","x","x",7,null,null,"w","w","w","w","x","w","w","w","w","w",1,null,null,"w","x","w","w","w","w","w","w","w","w",1,null,null,"w","w","w","w","w","w","w","w",3,"w",1,null,null,"w","x","w","w",3,"w","w","w","w","w",2,null,null,"w","w",3,"w","w","w","w","w","w","w",1,null,null,"k","w","x","w","w","x","w","w","w","w",3]
[null,null,"w","w","w","w","w","w","w","w","w","w",0,null,null,"w","w","w","w","w","w","w","w","w","w",0,null,null,"w","w","w","w","o","w","w","w","w","w",1,null,null,"w","x","w",2,"w","w","w","w","w","w",2,null,null,"w","w",4,4,4,4,"w","w",3,"w",5,null,null,"w","w","w","w","w","w","w","w","w","w",0,null,null,"w","w","o","w","w","w",2,2,"w",2,4,null,null,"w","w","x","w","w",4,"w","w","x","x",4]
[null,null,"w","w","w","w","w","x","w",3,"w",2,3,null,null,"w","w","w","w","w","w","w","w","w","w",0,null,null,"w","w","w","w","w","w","w","w","w","w",0,null,null,"w","x","w",2,"w","w","x","w","w","w",3,null,null,"x","w","w","w","w","w","w","w","w","w",1,null,null,"w","w","w","w","w","w","w","w","w","w",0,null,null,"w","w","w","w","w","w","w","w","w",2,1,null,null,"x","w","x","w","w",4,"w","w","w","w",3]
[null,null,"w","w","w","w","w","x","w",3,"w",2,3,null,null,"w","w","x","w","w","x","w","w","w","w",2,null,null,"w","w","x","x","x","w","w","w","w","w",3,null,null,"w","w","w","w","w","w","q","w","w","w",1,null,null,"w","w","w","w",3,"w","w","w","w","w",1,null,null,"x","w","x","w","w","w","w","w","w","w",2,null,null,"w","w","w","x","w","w","w","w","w","w",1,null,null,"w","w","w","w","w",4,"w","w","w","w",1]
[null,null,4,4,4,4,"w","x","w",3,"w","w",6,null,null,"w","w","o","w","w","w","w","w","w","w",1,null,null,"w","w","w","w","w","w","w","w","w","w",0,null,null,"w",4,4,4,4,"w","x","w","w","w",5,null,null,"w","w","x","w",3,"w","w","u","w","w",3,null,null,"q","w","w","w","w","w","r","x","w","w",3,null,null,"w","w","w","w","w","x","w","x","w","x",3,null,null,"w",2,"w","w","w","w","w","w","x","x",3]
[null,null,"w","w","w","w","w","w","w","w","w","w",0,null,null,3,"w","w","w","w","x","x","x","w","w",4,null,null,"x","w","w","x","w","w","w","w","w","x",3,null,null,"w","w","w","w","w","w","w","w","w","x",1,null,null,"w","w","w","w",3,"w","w","o","w","w",2,null,null,"x","w","x","l","w","w","w","w","w","w",3,null,null,"x","x","x","x","w","w","w","w","w","x",5,null,null,"w",2,"w","w","w","w","w","w","w","w",1]
[null,null,"w","x","w","x","w","x","w","w","w","w",3,null,null,3,"w","w","w","w","w","w","w","w","w",1,null,null,"w","w","w","x","w","w","w","w","w","w",1,null,null,"w","w","u","w","w","w","w","w","w","w",1,null,null,"w","w","w","w","w","w","w","w","w","w",0,null,null,"w","w","w","w","w","w","w","w","x","w",1,null,null,"w","w","w","w","w","w","u","w","w","x",2,null,null,"w","w","w","w","w","w","r","x","x","w",3]
[null,null,"w","w","w","w","w","x","w","w","w","w",1,null,null,3,"w","w","w","w","w","w","k","w","w",2,null,null,"x","x","w","x","w","x",4,4,4,"w",7,null,null,"w","w","x","w","w","x","w","w","w","w",2,null,null,"w","w","w","x","w","w","w","w","w","x",2,null,null,"w","w","w","w","w","x","w","w","x","w",2,null,null,"w","w","w","w","w","w","x","w","w","w",1,null,null,"x","w","w","w","w","w","w","w","w","w",1]
[null,{"$f":"SUM(C149:L149)","v":20},1,2,1,3,1,5,0,4,0,3,{"$f":"SUM(M139:M148)","v":20},null,{"$f":"SUM(P149:Y149)","v":20},4,0,4,2,1,4,1,2,1,1,{"$f":"SUM(Z139:Z148)","v":20},null,{"$f":"SUM(AC149:AL149)","v":20},2,2,1,5,4,1,1,1,2,1,{"$f":"SUM(AM139:AM148)","v":20},null,{"$f":"SUM(AP149:AY149)","v":20},1,5,3,3,2,1,4,0,0,1,{"$f":"SUM(AZ139:AZ148)","v":20},null,{"$f":"SUM(BC149:BL149)","v":20},1,2,2,3,5,1,0,2,3,1,{"$f":"SUM(BM139:BM148)","v":20},null,{"$f":"SUM(BP149:BY149)","v":20},3,2,2,1,3,1,2,2,3,1,{"$f":"SUM(BZ139:BZ148)","v":20},null,{"$f":"SUM(CC149:CL149)","v":20},2,1,4,2,0,1,3,2,0,5,{"$f":"SUM(CM139:CM148)","v":20},null,{"$f":"SUM(CP149:CY149)","v":20},3,2,3,0,0,5,1,1,3,2,{"$f":"SUM(CZ139:CZ148)","v":20}]
[]
[null,null,"Tagi, 10.07.21",null,null,null,null,null,null,null,null,null,null,null,null,"Migros-Magazin, 12.07.21",null,null,null,null,null,null,null,null,null,null,null,null,"Tagi, 12.07.21",null,null,null,null,null,null,null,null,null,null,null,null,"Tagi, 14.07.21",null,null,null,null,null,null,null,null,null,null,null,null,"Tagi, 15.07.21",null,null,null,null,null,null,null,null,null,null,null,null,"Tagi, 16.07.21",null,null,null,null,null,null,null,null,null,null,null,null,"Tagi, 17.07.21",null,null,null,null,null,null,null,null,null,null,null,null,"Tagi, 19.07.21"]
[null,49,null,null,null,null,null,null,null,null,null,null,4,null,50,null,null,null,null,null,null,null,null,null,null,5,null,51,null,null,null,null,null,null,"r",null,null,null,6,null,52,null,null,null,null,null,null,null,"w",null,null,3,null,53,null,null,null,null,null,null,null,null,null,null,1,null,54,null,null,null,null,null,null,null,null,"k",null,3,null,55,null,null,null,null,null,null,null,null,null,null,1,null,56,null,null,null,null,null,null,null,null,null,null,2]
[null,"Tagi, 10.07.21",null,null,null,null,null,null,null,null,null,null,0,null,"Migros-Magazin, 12.07.21",null,"l",null,null,null,null,null,null,null,null,2,null,"Tagi, 12.07.21",null,null,null,null,null,null,null,null,null,null,1,null,"Tagi, 14.07.21",null,null,null,null,null,null,null,null,null,null,1,null,"Tagi, 15.07.21",null,null,null,null,null,null,null,null,null,null,0,null,"Tagi, 16.07.21",null,null,null,null,null,null,null,null,null,null,0,null,"Tagi, 17.07.21",null,null,"l",null,null,null,null,null,null,null,3,null,"Tagi, 19.07.21",null,null,null,null,null,null,null,null,null,null,0]
[null,null,null,null,null,null,null,null,null,null,null,null,1,null,null,null,null,null,"u",null,null,null,null,null,null,1,null,null,null,null,null,"w",null,null,null,null,null,null,3,null,null,null,null,null,null,null,null,null,null,"q",null,3,null,null,null,null,null,null,null,null,null,null,null,null,4,null,null,null,null,null,null,null,null,null,null,null,null,3,null,null,null,null,null,null,"w",null,null,null,null,null,3,null,null,null,null,null,null,null,null,null,null,null,null,3]
[null,null,null,null,null,null,null,null,null,null,null,null,1,null,null,null,null,null,null,null,null,null,null,null,null,3,null,null,null,null,null,null,null,null,null,null,null,null,0,null,null,null,null,null,null,null,null,null,null,null,null,0,null,null,null,null,null,null,null,null,null,null,null,null,2,null,null,null,null,null,"k",null,null,null,null,null,null,1,null,null,null,null,null,null,null,null,null,null,null,null,2,null,null,null,null,"l",null,null,null,null,null,null,null,4]
[null,null,null,null,null,null,null,null,null,null,"u",null,2,null,null,null,null,null,null,null,null,"l",null,null,null,4,null,null,null,"l",null,null,null,null,null,null,null,null,3,null,null,null,null,null,null,null,null,null,null,null,null,5,null,null,null,null,null,null,null,null,null,null,null,null,2,null,null,null,null,null,null,null,null,null,null,null,null,0,null,null,null,null,null,null,null,null,null,null,null,null,4,null,null,null,null,null,null,null,"k",null,null,null,null,1]
[null,null,null,null,null,null,null,null,null,null,null,null,3,null,null,null,null,null,null,null,null,null,null,null,null,2,null,null,null,null,null,null,null,null,null,null,null,null,1,null,null,null,null,null,null,null,null,null,null,null,null,3,null,null,null,null,null,null,null,null,null,null,null,null,0,null,null,null,null,null,null,null,null,null,null,null,null,3,null,null,null,null,null,null,null,null,null,null,null,null,1,null,null,null,null,null,null,null,null,null,null,null,null,1]
[null,null,"k",null,null,null,null,"q",null,null,null,null,3,null,null,null,null,null,null,null,null,null,null,null,null,0,null,null,null,null,null,null,null,null,null,null,null,null,2,null,null,null,null,null,null,null,null,null,null,null,null,0,null,null,null,null,null,null,null,null,null,null,"k",null,2,null,null,null,null,null,null,null,null,"q",null,null,null,3,null,null,"r",null,null,null,"r",null,null,null,null,null,5,null,null,null,null,null,null,null,null,null,null,null,null,3]
[null,null,null,null,null,null,null,null,null,null,null,null,1,null,null,null,null,null,null,null,null,null,null,null,null,2,null,null,null,null,null,null,null,null,null,null,null,null,3,null,null,null,null,null,null,null,null,null,null,null,null,0,null,null,null,null,null,null,null,null,null,null,null,null,2,null,null,null,null,null,null,null,null,null,null,null,null,0,null,null,null,null,null,null,null,null,null,null,null,null,0,null,null,null,null,null,null,null,null,null,null,null,null,1]
[null,null,null,null,null,null,null,null,null,null,null,null,4,null,null,null,null,null,null,null,null,null,null,null,null,0,null,null,null,null,null,null,null,null,null,null,null,null,0,null,null,null,null,null,null,null,null,null,null,null,null,3,null,null,null,null,null,null,null,null,null,null,null,null,5,null,null,null,null,null,null,null,null,null,null,null,null,6,null,null,null,null,null,null,null,null,null,null,null,null,0,null,null,null,null,null,null,null,"r",null,null,null,null,3]
[null,null,null,null,"k",null,null,null,null,null,null,null,1,null,null,null,null,null,null,null,null,null,null,null,null,1,null,null,null,null,null,null,null,null,null,null,null,null,1,null,null,null,"l",null,null,null,null,null,null,null,null,2,null,null,null,null,null,null,null,"l",null,null,null,null,2,null,null,"w",null,null,null,null,null,null,null,null,null,1,null,null,null,null,null,null,null,null,null,null,null,null,1,null,null,null,null,null,null,null,null,null,null,null,null,2]
[null,{"$f":"SUM(C162:L162)","v":20},1,0,3,1,0,7,1,1,5,1,{"$f":"SUM(M152:M161)","v":20},null,{"$f":"SUM(P162:Y162)","v":20},1,3,1,5,0,1,3,1,1,4,{"$f":"SUM(Z152:Z161)","v":20},null,{"$f":"SUM(AC162:AL162)","v":20},1,1,1,5,1,2,1,2,0,6,{"$f":"SUM(AM152:AM161)","v":20},null,{"$f":"SUM(AP162:AY162)","v":20},2,1,3,2,3,2,0,3,1,3,{"$f":"SUM(AZ152:AZ161)","v":20},null,{"$f":"SUM(BC162:BL162)","v":20},4,2,1,0,3,3,1,2,3,1,{"$f":"SUM(BM152:BM161)","v":20},null,{"$f":"SUM(BP162:BY162)","v":20},3,1,1,2,1,4,4,1,1,2,{"$f":"SUM(BZ152:BZ161)","v":20},null,{"$f":"SUM(CC162:CL162)","v":20},5,2,1,1,2,1,3,1,0,4,{"$f":"SUM(CM152:CM161)","v":20},null,{"$f":"SUM(CP162:CY162)","v":20},1,2,6,0,0,3,3,1,3,1,{"$f":"SUM(CZ152:CZ161)","v":20}]
[null,null,"Lösung",null,null,null,null,null,null,null,null,null,null,null,null,"Lösung",null,null,null,null,null,null,null,null,null,null,null,null,"Lösung",null,null,null,null,null,null,null,null,null,null,null,null,"Lösung",null,null,null,null,null,null,null,null,null,null,null,null,"Lösung",null,null,null,null,null,null,null,null,null,null,null,null,"Lösung",null,null,null,null,null,null,null,null,null,null,null,null,"Lösung",null,null,null,null,null,null,null,null,null,null,null,null,"Lösung"]
[null,49,"w","w","w","x","w","x","x","w","x","w",4,null,50,"w","w","w","x","w","w","x","x","x","x",5,null,51,"w","w","x","x","x","w","r","x","w","x",6,null,52,"w","w","x","w","x","w","w","w","w","x",3,null,53,"w","x","w","w","w","w","w","w","w","w",1,null,54,"w","w","w","w","w","x","x","w","k","w",3,null,55,"w","w","w","w","x","w","w","w","w","w",1,null,56,"w","x","x","w","w","w","w","w","w","w",2]
[null,"Tagi, 10.07.21","w","w","w","w","w","w","w","w","w","w",0,null,"Migros-Magazin, 12.07.21","r","l","w","w","w","w","w","w","w","w",2,null,"Tagi, 12.07.21","w","w","w","w","w","w","w","w","w","x",1,null,"Tagi, 14.07.21","w","w","x","w","w","w","w","w","w","w",1,null,"Tagi, 15.07.21","w","w","w","w","w","w","w","w","w","w",0,null,"Tagi, 16.07.21","w","w","w","w","w","w","w","w","w","w",0,null,"Tagi, 17.07.21","x","x","l","w","w","w","w","w","w","w",3,null,"Tagi, 19.07.21","w","w","w","w","w","w","w","w","w","w",0]
[null,null,"w","w","w","w","w","x","w","w","w","w",1,null,null,"w","w","w","u","w","w","w","w","w","w",1,null,null,"w","w","w","w","w","x","w","x","w","x",3,null,null,"w","w","w","w","w","w","w","x","q","x",3,null,null,"w","w","w","w","w","x","x","x","x","w",4,null,null,"x","w","w","w","w","x","x","w","w","w",3,null,null,"w","w","w","w","w","w","x","x","w","x",3,null,null,"w","w","w","w","w","x","x",3,"w","w",3]
[null,null,"w","w","w","w","w","x","w","w","w","w",1,null,null,"w","x","w",3,"w","w","w","w","w",3,3,null,null,"w","w","w","w","w","w","w","w","w","w",0,null,null,"w","w","w","w","w","w","w","w","w","w",0,null,null,"x","x","w","w","w","w","w","w","w","w",2,null,null,"w","w","w","k","w","w","w","w","w","w",1,null,null,"x","w","w","w","w","w","w","w","w",4,2,null,null,3,3,3,"w","w","w","w","w","w","x",4]
[null,null,"w","w",2,"w","w","w","w","w","u","w",2,null,null,"w","w","w",3,"w","x","l","w","w",3,4,null,null,"x","l","w",4,"w","w","w","w","w","w",3,null,null,"w","w",4,4,4,4,"w","x","w","w",5,null,null,"w","w","w","w",2,2,"w","w","w","w",2,null,null,"w","w","w","w","w","w","w","w","w","w",0,null,null,"x","w","w","x","w","w","x","w","w",4,4,null,null,"w","w","w","w","w","k","w","w","w","w",1]
[null,null,"w","w",2,"w","w","x","w","w","x","w",3,null,null,"w","x","w","w","w","w","w","w","w",3,2,null,null,"w","w","w",4,"w","w","w","w","w","w",1,null,null,"x","w","w","w","w","w","w","x","w","x",3,null,null,"w","w","w","w","w","w","w","w","w","w",0,null,null,3,3,3,"w","w","w","w","w","w","w",3,null,null,"w","w","w","w","w","w","w","w","w",4,1,null,null,"w","w","w","w","w","w","w","w","x","w",1]
[null,null,"k","w","w","w","w","q","w","w","x","w",3,null,null,"w","w","w","w","w","w","w","w","w","w",0,null,null,"w","w","w",4,"w","w","w","w","w","x",2,null,null,"w","w","w","w","w","w","w","w","w","w",0,null,null,3,"w","w","w","w","w","w","w","k","w",2,null,null,"w","w","w","w","w","x","q","x","w","w",3,null,null,"r","x","w","w","r","x","x","w","w","w",5,null,null,"w","w",4,"w","w","w","x","w","x","w",3]
[null,null,"w","w","w","w","w","x","w","w","w","w",1,null,null,"w","w",2,2,"w","w","w","w","w","w",2,null,null,"w","w","w",4,"w","x","w","w","w","x",3,null,null,"w","w","w","w","w","w","w","w","w","w",0,null,null,3,"w","w","w","x","w","w","w","w","w",2,null,null,"w","w","w","w","w","w","w","w","w","w",0,null,null,"w","w","w","w","w","w","w","w","w","w",0,null,null,"w","w",4,"w","w","w","w","w","w","w",1]
[null,null,"w","w","w","w","w","x","w","x","x","x",4,null,null,"w","w","w","w","w","w","w","w","w","w",0,null,null,"w","w","w","w","w","w","w","w","w","w",0,null,null,"w","w","w",3,3,3,"w","w","w","w",3,null,null,3,"w","x","w","w","w","w",3,3,3,5,null,null,"x","w","w","x","x","x","x","w","w","x",6,null,null,"w","w","w","w","w","w","w","w","w","w",0,null,null,"w","w",4,"w","w","r","x","w","w","w",3]
[null,null,"w","w","k","w","w","w","w","w","w","w",1,null,null,"w","w","w","w","w","w","x","w","w","w",1,null,null,"w","w","w","w","w","w","w","w","w","x",1,null,null,"r","l","w","w","w","w","w","w","w","w",2,null,null,"w","w","w","w","r","l","w","w","w","w",2,null,null,"w","w","w","w","w","w","w","w","w","x",1,null,null,"x","w","w","w","w","w","w","w","w","w",1,null,null,"w","w","x","w","w","w","w","w","x","w",2]
[null,{"$f":"SUM(C174:L174)","v":20},1,0,3,1,0,7,1,1,5,1,{"$f":"SUM(M164:M173)","v":20},null,{"$f":"SUM(P174:Y174)","v":20},1,3,1,5,0,1,3,1,1,4,{"$f":"SUM(Z164:Z173)","v":20},null,{"$f":"SUM(AC174:AL174)","v":20},1,1,1,5,1,2,1,2,0,6,{"$f":"SUM(AM164:AM173)","v":20},null,{"$f":"SUM(AP174:AY174)","v":20},2,1,3,2,3,2,0,3,1,3,{"$f":"SUM(AZ164:AZ173)","v":20},null,{"$f":"SUM(BC174:BL174)","v":20},4,2,1,0,3,3,1,2,3,1,{"$f":"SUM(BM164:BM173)","v":20},null,{"$f":"SUM(BP174:BY174)","v":20},3,1,1,2,1,4,4,1,1,2,{"$f":"SUM(BZ164:BZ173)","v":20},null,{"$f":"SUM(CC174:CL174)","v":20},5,2,1,1,2,1,3,1,0,4,{"$f":"SUM(CM164:CM173)","v":20},null,{"$f":"SUM(CP174:CY174)","v":20},1,2,6,0,0,3,3,1,3,1,{"$f":"SUM(CZ164:CZ173)","v":20}]
[]
[null,null,"Tagi, 20.07.21",null,null,null,null,null,null,null,null,null,null,null,null,"Beobachter, 16.07.21",null,null,null,null,null,null,null,null,null,null,null,null,"Tagi, 21.07.21",null,null,null,null,null,null,null,null,null,null,null,null,"Tagi, 22.07.21",null,null,null,null,null,null,null,null,null,null,null,null,"Tagi, 23.07.21",null,null,null,null,null,null,null,null,null,null,null,null,"Tagi, 24.07.21",null,null,null,null,null,null,null,null,null,null,null,null,"Tagi, 26.07.21",null,null,null,null,null,null,null,null,null,null,null,null,"Tagi, 27.07.21"]
[null,57,null,null,null,null,null,null,null,null,null,null,1,null,58,null,null,null,null,null,null,null,null,null,null,0,null,59,null,null,null,null,null,null,null,null,null,null,1,null,60,null,null,"k",null,null,null,null,null,null,null,1,null,61,null,null,"k",null,null,null,null,null,null,null,2,null,62,null,null,null,null,null,null,null,null,null,null,3,null,63,null,"k",null,null,null,null,null,null,null,"w",2,null,64,null,null,null,null,null,null,null,null,null,null,1]
[null,"Tagi, 20.07.21",null,null,null,null,null,null,null,null,null,null,1,null,"Beobachter, 16.07.21",null,null,null,null,null,null,null,null,null,null,0,null,"Tagi, 21.07.21",null,null,"o",null,null,null,null,null,null,null,5,null,"Tagi, 22.07.21",null,null,null,null,null,null,null,null,null,null,5,null,"Tagi, 23.07.21",null,null,null,null,null,null,null,null,null,null,4,null,"Tagi, 24.07.21",null,null,null,null,null,null,null,null,null,null,2,null,"Tagi, 26.07.21",null,null,null,null,null,null,null,null,null,null,1,null,"Tagi, 27.07.21",null,null,null,null,null,"o",null,null,null,null,3]
[null,null,null,null,null,null,null,"k",null,null,null,null,1,null,null,null,null,null,null,null,null,null,null,null,null,1,null,null,null,null,null,null,null,null,null,null,null,null,1,null,null,null,null,null,null,null,null,null,null,null,null,0,null,null,null,null,null,null,null,null,null,null,null,null,2,null,null,null,null,null,null,null,"r",null,null,null,null,3,null,null,null,null,null,null,null,null,null,null,null,null,4,null,null,null,null,null,null,null,null,null,null,null,null,0]
[null,null,"k",null,null,null,null,null,null,null,null,null,5,null,null,null,null,null,null,null,null,null,null,null,null,4,null,null,null,null,null,null,null,null,null,null,null,null,2,null,null,null,null,null,null,null,null,null,null,null,null,5,null,null,null,null,null,null,null,null,null,null,null,null,1,null,null,null,null,null,null,null,null,null,null,null,null,1,null,null,null,null,null,null,null,null,null,null,null,null,0,null,null,null,null,null,null,null,null,null,null,null,null,1]
[null,null,null,null,null,"o",null,null,null,null,null,null,1,null,null,null,null,null,null,null,null,null,null,null,null,1,null,null,null,null,null,null,null,null,null,null,null,null,2,null,null,null,null,null,null,null,null,null,null,null,null,2,null,null,null,null,null,null,null,null,null,null,"u",null,3,null,null,null,null,null,null,null,null,null,null,null,null,2,null,null,null,null,null,null,null,null,null,"l",null,null,2,null,null,null,null,null,null,null,null,null,null,null,null,1]
[null,null,null,null,null,null,null,null,null,null,null,null,3,null,null,null,null,null,"w",null,null,null,null,null,null,4,null,null,null,null,null,null,null,null,null,null,null,null,2,null,null,null,null,null,"k",null,null,null,null,null,null,2,null,null,null,null,null,null,null,null,null,null,null,null,2,null,null,null,null,null,null,null,null,null,null,null,null,1,null,null,"u",null,null,null,null,null,null,null,null,null,1,null,null,null,null,null,null,null,null,"r",null,null,null,6]
[null,null,null,null,null,null,null,null,null,null,null,null,0,null,null,null,null,null,null,null,null,null,null,null,null,0,null,null,null,null,null,null,null,null,null,null,null,null,1,null,null,null,null,null,null,null,null,null,null,null,null,1,null,null,null,null,null,null,null,null,null,null,null,null,1,null,null,null,null,null,"q",null,null,null,null,null,null,2,null,null,null,null,null,null,null,null,null,null,null,null,2,null,null,null,null,null,null,null,null,null,null,null,null,2]
[null,null,null,null,null,null,null,"w",null,null,null,null,3,null,null,null,null,null,null,null,null,null,null,null,null,4,null,null,null,null,null,null,null,null,null,"l",null,null,2,null,null,null,null,null,null,null,null,null,null,null,null,0,null,null,null,null,null,null,null,null,null,null,null,null,0,null,null,null,null,null,null,null,null,"o",null,null,null,3,null,null,null,null,null,null,null,null,null,null,null,null,7,null,null,null,null,null,null,null,null,null,null,null,null,1]
[null,null,null,null,null,null,null,null,null,null,null,null,0,null,null,null,null,null,null,null,null,null,null,"w",null,1,null,null,null,null,null,null,null,null,null,null,null,null,2,null,null,"u",null,null,null,null,null,null,null,null,null,3,null,null,null,null,null,null,null,null,null,null,null,null,4,null,null,null,null,null,null,null,null,null,null,null,null,1,null,null,null,null,null,null,null,null,null,null,null,null,0,null,null,null,null,"w",null,null,null,null,null,null,null,1]
[null,null,null,null,null,null,null,null,null,null,null,null,5,null,null,null,null,null,null,null,null,null,null,null,null,5,null,null,null,null,null,null,null,null,"k",null,"w",null,2,null,null,null,null,null,null,null,null,null,null,null,null,1,null,null,null,null,null,null,null,null,null,"k",null,null,1,null,null,"k",null,null,null,null,null,null,null,null,null,2,null,null,null,null,null,null,null,null,null,null,null,null,1,null,null,null,null,null,null,null,null,null,null,"l",null,4]
[null,{"$f":"SUM(C187:L187)","v":20},1,1,2,2,0,3,2,3,2,4,{"$f":"SUM(M177:M186)","v":20},null,{"$f":"SUM(P187:Y187)","v":20},0,0,1,4,2,1,6,1,4,1,{"$f":"SUM(Z177:Z186)","v":20},null,{"$f":"SUM(AC187:AL187)","v":20},2,4,2,3,0,0,3,2,2,2,{"$f":"SUM(AM177:AM186)","v":20},null,{"$f":"SUM(AP187:AY187)","v":20},4,1,2,1,1,5,1,0,3,2,{"$f":"SUM(AZ177:AZ186)","v":20},null,{"$f":"SUM(BC187:BL187)","v":20},2,2,2,0,4,2,2,2,2,2,{"$f":"SUM(BM177:BM186)","v":20},null,{"$f":"SUM(BP187:BY187)","v":20},5,1,0,3,0,2,5,1,0,3,{"$f":"SUM(BZ177:BZ186)","v":20},null,{"$f":"SUM(CC187:CL187)","v":20},4,2,3,2,0,1,2,3,0,3,{"$f":"SUM(CM177:CM186)","v":20},null,{"$f":"SUM(CP187:CY187)","v":20},2,0,4,0,1,2,2,2,5,2,{"$f":"SUM(CZ177:CZ186)","v":20}]
[null,null,"Lösung",null,null,null,null,null,null,null,null,null,null,null,null,"Lösung",null,null,null,null,null,null,null,null,null,null,null,null,"Lösung",null,null,null,null,null,null,null,null,null,null,null,null,"Lösung",null,null,null,null,null,null,null,null,null,null,null,null,"Lösung",null,null,null,null,null,null,null,null,null,null,null,null,"Lösung",null,null,null,null,null,null,null,null,null,null,null,null,"Lösung",null,null,null,null,null,null,null,null,null,null,null,null,"Lösung"]
[null,57,"w","w","w","w","w","w","w","w","w",2,1,null,58,"w","w","w","w","w","w","w","w","w","w",0,null,59,"w","w","u","w","w","w","w","w","w","w",1,null,60,"w","w","k","w","w","w","w","w","w","w",1,null,61,"w","w","k","w","w","w","w","w","w","x",2,null,62,"w","w","w","w","w",3,3,3,"w","w",3,null,63,"w","k","w","w","w","w","w","x","w","w",2,null,64,"w","w","w","w","w","u","w","w","w","w",1]
[null,"Tagi, 20.07.21","w","w","w","w","w","w","w","w","w",2,1,null,"Beobachter, 16.07.21","w","w","w","w","w","w","w","w","w","w",0,null,"Tagi, 21.07.21","w","w","o","w","w","w","x","x","x","x",5,null,"Tagi, 22.07.21","x","w","w","w",3,3,3,"w","w","x",5,null,"Tagi, 23.07.21","w","w","w","w","w",3,3,3,"w",2,4,null,"Tagi, 24.07.21",4,"w","w","w","w","w","w","w","w","x",2,null,"Tagi, 26.07.21","w","w","w","w","w","w","w","w","w","x",1,null,"Tagi, 27.07.21","w","w","w","w","w","o","w","w","x","x",3]
[null,null,"w","w","w","w","w","k","w","w","w","w",1,null,null,"w","w","w","w","w","w","x","w","w","w",1,null,null,"x","w","w","w","w","w","w","w","w","w",1,null,null,"w","w","w","w","w","w","w","w","w","w",0,null,null,2,2,"w","w","w","w","w","w","w","w",2,null,null,4,"w","w","w","w","r","x","w","w","w",3,null,null,4,4,4,4,"w","w","w","w","w","w",4,null,null,"w","w","w","w","w","w","w","w","w","w",0]
[null,null,"k","w","w","u","w","w","w","x","x","x",5,null,null,"w","w","w","x","x","w","x","w","x","w",4,null,null,"w","w","w",3,"w","w","w","w","x","w",2,null,null,3,3,3,"w","w",4,"w","w",2,"w",5,null,null,"w","w","w","w","x","w","w","w","w","w",1,null,null,4,"w","w","w","w","w","w","w","w","w",1,null,null,"w","w","w","w","w","w","w","w","w","w",0,null,null,"w","w","w","w","w","w","w","w","x","w",1]
[null,null,"w","w","w","o","w","w","w","w","w","w",1,null,null,"w","w","w","w","w","w","x","w","w","w",1,null,null,"w",3,"w",3,"w","w","w","w","w","w",2,null,null,"w","w","w","w","w",4,"w","w",2,"w",2,null,null,"w","w","w","w","x","w","x","w","u","w",3,null,null,"x","w","w","w","w","w","x","w","w","w",2,null,null,"w","w","w","w","w","w","r","l","w","w",2,null,null,"w","w","x","w","w","w","w","w","w","w",1]
[null,null,"w","w","w","w","w",3,3,3,"w","w",3,null,null,"w","w","x","w","x","w","x","w","x","w",4,null,null,"w",3,"w",3,"w","w","w","w","w","w",2,null,null,"w","w","w","k","w",4,"w","w","w","w",2,null,null,"w","w","w","w","x","w","w","w","o","w",2,null,null,"w","w","w","x","w","w","w","w","w","w",1,null,null,"u","w","w","w","w","w","w","w","w","w",1,null,null,2,"w","x","w","w","w","r","x","x","x",6]
[null,null,"w","w","w","w","w","w","w","w","w","w",0,null,null,"w","w","w","w","w","w","w","w","w","w",0,null,null,"w",3,"w","w","w","w","w","w","w","w",1,null,null,"w","w","w","w","w",4,"w","w","w","w",1,null,null,"w","w","w","w","x","w","w","w","w","w",1,null,null,"w","w","w","q","w","w","x","w","w","w",2,null,null,"x","w","w","w","w","w","w","w","w","x",2,null,null,2,"w","x","w","w","w","w","w","w","w",2]
[null,null,"w","x","x","w","w","w","w","w","w","x",3,null,null,"w","w","w","x","w","w","x","x","x","w",4,null,null,"w","w","w","w","w","w","r","l","w","w",2,null,null,"w","w","w","w","w","w","w","w","w","w",0,null,null,"w","w","w","w","w","w","w","w","w","w",0,null,null,"w","x","w","x","w","w","o","w","w","w",3,null,null,"x","w","x","x","w","x","x","x","w","x",7,null,null,"w","w","w","w","w","w","w","w","x","w",1]
[null,null,"w","w","w","w","w","w","w","w","w","w",0,null,null,"w","w","w","x","w","w","w","w","w","w",1,null,null,2,2,"w","w","w","w","w","w","w","w",2,null,null,"u","w","w","w","w","w","w","w","x","x",3,null,null,3,3,3,"w","w","x","w","w","w","w",4,null,null,"w","w","w","w","w","w","w","w","w",2,1,null,null,"w","w","w","w","w","w","w","w","w","w",0,null,null,"w","w","w","w","x","w","w","w","w","w",1]
[null,null,"w","w","x","w","w","x",4,4,4,"w",5,null,null,"w","w","w","x","w",2,2,"w",2,2,5,null,null,"w","w","w","w","w","w","k","w","w","x",2,null,null,"x","w","w","w","w","w","w","w","w","w",1,null,null,"w","w","w","w","w","w","w","k","w","w",1,null,null,"k","w","w","w","w","w","w","w","w",2,2,null,null,"w","w","x","w","w","w","w","w","w","w",1,null,null,"w","w","x","w","w","w","x","x","l","w",4]
[null,{"$f":"SUM(C199:L199)","v":20},1,1,2,2,0,3,2,3,2,4,{"$f":"SUM(M189:M198)","v":20},null,{"$f":"SUM(P199:Y199)","v":20},0,0,1,4,2,1,6,1,4,1,{"$f":"SUM(Z189:Z198)","v":20},null,{"$f":"SUM(AC199:AL199)","v":20},2,4,2,3,0,0,3,2,2,2,{"$f":"SUM(AM189:AM198)","v":20},null,{"$f":"SUM(AP199:AY199)","v":20},4,1,2,1,1,5,1,0,3,2,{"$f":"SUM(AZ189:AZ198)","v":20},null,{"$f":"SUM(BC199:BL199)","v":20},2,2,2,0,4,2,2,2,2,2,{"$f":"SUM(BM189:BM198)","v":20},null,{"$f":"SUM(BP199:BY199)","v":20},5,1,0,3,0,2,5,1,0,3,{"$f":"SUM(BZ189:BZ198)","v":20},null,{"$f":"SUM(CC199:CL199)","v":20},4,2,3,2,0,1,2,3,0,3,{"$f":"SUM(CM189:CM198)","v":20},null,{"$f":"SUM(CP199:CY199)","v":20},2,0,4,0,1,2,2,2,5,2,{"$f":"SUM(CZ189:CZ198)","v":20}]
[]
[null,null,"Migros-Magazin, 27.02.21",null,null,null,null,null,null,null,null,null,null,null,null,"Tagi, 28.07.21",null,null,null,null,null,null,null,null,null,null,null,null,"Tagi, 29.07.21",null,null,null,null,null,null,null,null,null,null,null,null,"Tagi, 30.07.21",null,null,null,null,null,null,null,null,null,null,null,null,"Tagi, 31.07.21",null,null,null,null,null,null,null,null,null,null,null,null,"Tagi, 02.08.21",null,null,null,null,null,null,null,null,null,null,null,null,"Tagi, 03.08.21",null,null,null,null,null,null,null,null,null,null,null,null,"Tagi, 04.08.21"]
[null,65,null,null,null,null,null,null,null,null,null,null,3,null,66,null,null,null,"k",null,null,null,null,null,null,4,null,67,null,null,null,null,null,null,null,null,null,null,1,null,68,null,null,null,null,null,null,null,null,null,null,3,null,69,null,null,null,null,null,null,null,null,null,null,2,null,70,null,null,null,null,null,null,null,null,null,"k",2,null,71,null,null,null,null,null,null,null,null,null,null,2,null,72,null,null,null,null,null,null,null,null,null,null,1]
[null,"Migros-Magazin, 27.02.21",null,null,null,null,null,null,null,null,null,null,0,null,"Tagi, 28.07.21",null,null,null,null,null,null,null,null,null,null,0,null,"Tagi, 29.07.21",null,null,null,null,null,null,null,"r",null,null,2,null,"Tagi, 30.07.21",null,null,null,null,null,null,null,null,null,null,0,null,"Tagi, 31.07.21",null,null,null,null,null,null,null,null,null,null,0,null,"Tagi, 02.08.21",null,null,null,null,null,null,null,null,null,null,0,null,"Tagi, 03.08.21",null,null,null,null,null,null,null,null,null,null,1,null,"Tagi, 04.08.21",null,null,null,null,null,null,null,null,null,null,0]
[null,null,null,null,null,null,null,null,null,null,null,null,0,null,null,null,null,null,null,null,null,null,null,null,null,3,null,null,null,null,null,null,null,null,null,null,null,null,0,null,null,null,"k",null,null,null,null,null,null,null,null,3,null,null,null,null,null,"w",null,null,null,null,null,null,5,null,null,null,null,null,null,null,null,null,"l",null,null,5,null,null,null,null,null,null,null,null,null,null,null,null,0,null,null,null,null,null,null,null,null,null,null,null,null,3]
[null,null,null,null,null,null,null,null,null,null,null,null,4,null,null,null,"q",null,null,null,null,null,null,null,null,2,null,null,null,null,null,null,null,null,null,null,null,null,8,null,null,null,null,null,null,null,null,null,null,null,null,1,null,null,null,null,null,null,null,null,null,null,null,null,2,null,null,null,null,null,null,null,null,null,null,null,null,1,null,null,null,null,null,null,null,null,null,null,"u",null,1,null,null,null,null,null,null,null,null,null,null,null,null,3]
[null,null,null,null,null,null,null,null,null,null,null,null,0,null,null,null,null,null,null,null,null,null,null,null,null,2,null,null,null,null,null,null,null,null,null,null,null,null,0,null,null,null,null,null,null,null,null,null,null,null,null,0,null,null,null,null,null,null,null,null,null,null,null,null,3,null,null,null,null,null,null,null,null,null,null,null,null,3,null,null,null,null,null,null,null,null,null,null,null,null,5,null,null,null,null,null,null,null,"o",null,null,null,null,2]
[null,null,null,null,null,null,null,null,null,null,null,null,3,null,null,null,null,null,null,null,null,null,null,null,null,1,null,null,null,null,null,null,null,null,null,null,null,null,2,null,null,null,null,null,null,null,"r",null,null,null,null,4,null,null,null,null,null,null,null,null,null,null,null,null,0,null,null,null,null,null,null,null,null,null,null,null,null,1,null,null,null,null,null,null,null,null,"w",null,null,null,2,null,null,"q",null,null,null,null,null,null,null,null,null,2]
[null,null,null,null,null,null,null,null,"u",null,null,null,2,null,null,null,null,null,null,"o",null,null,null,null,null,1,null,null,null,null,null,null,null,null,null,null,null,null,3,null,null,null,null,null,null,null,null,null,null,null,null,2,null,null,null,null,null,null,null,null,null,null,"r",null,2,null,null,null,null,"r",null,null,null,null,null,null,null,3,null,null,null,null,null,null,null,null,null,null,null,null,4,null,null,null,null,null,null,null,null,null,null,null,null,3]
[null,null,null,null,null,"k",null,null,null,null,null,null,3,null,null,null,null,null,null,null,null,null,null,null,null,3,null,null,null,null,null,null,"o",null,null,null,null,null,2,null,null,null,null,null,null,null,null,null,null,null,null,3,null,null,null,null,"u",null,null,null,null,null,null,null,3,null,null,null,null,null,null,null,null,null,null,null,null,1,null,null,null,null,null,null,null,null,null,null,null,null,1,null,null,null,null,null,null,null,null,null,null,null,null,3]
[null,null,null,null,null,null,null,null,null,null,null,null,2,null,null,null,null,null,null,null,null,"k",null,null,null,3,null,null,null,null,null,null,null,null,null,null,null,null,0,null,null,null,null,null,null,null,null,null,null,null,null,1,null,null,null,null,null,null,null,null,null,null,null,null,2,null,null,null,null,null,null,null,null,null,null,null,null,2,null,null,null,null,null,null,null,null,null,null,null,null,1,null,null,null,null,null,null,null,null,null,null,null,null,2]
[null,null,"o",null,null,null,null,"l",null,null,null,null,3,null,null,null,null,null,null,null,null,null,null,null,null,1,null,null,null,null,null,"k",null,null,null,null,null,null,2,null,null,null,null,null,null,"o",null,"r",null,null,null,3,null,null,null,null,null,null,null,null,null,null,null,null,1,null,null,null,"l",null,null,null,null,null,null,null,null,2,null,null,null,null,"w",null,null,null,null,null,null,null,3,null,null,null,null,null,null,null,null,null,null,"o",null,1]
[null,{"$f":"SUM(C212:L212)","v":20},3,1,0,1,3,3,4,2,1,2,{"$f":"SUM(M202:M211)","v":20},null,{"$f":"SUM(P212:Y212)","v":20},2,3,0,1,6,0,1,2,2,3,{"$f":"SUM(Z202:Z211)","v":20},null,{"$f":"SUM(AC212:AL212)","v":20},4,1,1,2,2,1,2,5,1,1,{"$f":"SUM(AM202:AM211)","v":20},null,{"$f":"SUM(AP212:AY212)","v":20},1,2,0,1,6,2,2,4,1,1,{"$f":"SUM(AZ202:AZ211)","v":20},null,{"$f":"SUM(BC212:BL212)","v":20},4,2,2,2,0,2,1,2,3,2,{"$f":"SUM(BM202:BM211)","v":20},null,{"$f":"SUM(BP212:BY212)","v":20},3,4,3,2,0,0,5,1,0,2,{"$f":"SUM(BZ202:BZ211)","v":20},null,{"$f":"SUM(CC212:CL212)","v":20},3,0,5,1,0,2,5,0,2,2,{"$f":"SUM(CM202:CM211)","v":20},null,{"$f":"SUM(CP212:CY212)","v":20},4,3,1,0,2,3,1,0,5,1,{"$f":"SUM(CZ202:CZ211)","v":20}]
[null,null,"Lösung",null,null,null,null,null,null,null,null,null,null,null,null,"Lösung",null,null,null,null,null,null,null,null,null,null,null,null,"Lösung",null,null,null,null,null,null,null,null,null,null,null,null,"Lösung",null,null,null,null,null,null,null,null,null,null,null,null,"Lösung",null,null,null,null,null,null,null,null,null,null,null,null,"Lösung",null,null,null,null,null,null,null,null,null,null,null,null,"Lösung",null,null,null,null,null,null,null,null,null,null,null,null,"Lösung"]
[null,65,"w","w","w","w","w","x","x","x","w","w",3,null,66,"w","w","w","k","w","w","w","x","x","x",4,null,67,"x","w","w","w","w","w","w","w","w","w",1,null,68,"w","w","w",3,3,3,"w","w","w","w",3,null,69,"x","w","w","x","w","w","w","w","w","w",2,null,70,"w","x","w","w","w","w","w","w","w","k",2,null,71,"w","w","x","w","w","x","w","w","w","w",2,null,72,"w","x","w","w","w","w","w","w","w","w",1]
[null,"Migros-Magazin, 27.02.21","w","w","w","w","w","w","w","w","w","w",0,null,"Tagi, 28.07.21","w","w","w","w","w","w","w","w","w","w",0,null,"Tagi, 29.07.21","w","w","w","w","w","w","w","r","l","w",2,null,"Tagi, 30.07.21","w","w","w","w","w","w","w","w","w","w",0,null,"Tagi, 31.07.21","w","w","w","w","w","w","w","w","w","w",0,null,"Tagi, 02.08.21","w","w","w","w","w","w","w","w","w","w",0,null,"Tagi, 03.08.21","w","w","x","w","w","w","w","w","w","w",1,null,"Tagi, 04.08.21","w","w","w","w","w","w","w","w","w","w",0]
[null,null,"w","w","w","w","w","w","w","w","w","w",0,null,null,"w","x","w","w","w","w","w","x","w","x",3,null,null,"w","w","w","w","w","w","w","w","w","w",0,null,null,"w","k","w","w","x","w","w","x","w","w",3,null,null,"w","x","w","w","w","x","x","x","x","w",5,null,null,"x",3,3,"w","w","w","x","l","w","w",5,null,null,"w","w","w","w","w","w","w","w","w","w",0,null,null,"x","x","w","w","w","x","w","w","w","w",3]
[null,null,"w","w","w","w","x","x",4,4,"w","w",4,null,null,"w","q","w","w",4,"w","w","w","w","w",2,null,null,"x","x","x","x","w","x","x","x","w","x",8,null,null,"w","w","w","w","x","w","w","w","w","w",1,null,null,"w","x","w","x","w","w","w","w","w","w",2,null,null,"w","w","w","w","w","w","w","w","w","x",1,null,null,"w","w","w","w","w","w","w","w","u","w",1,null,null,"w","w","w","w","w","x","w","w","x","x",3]
[null,null,"w","w","w","w","w","w","w","w","w","w",0,null,null,"w","x","w","w",4,"w","w","w","w","w",2,null,null,"w","w","w","w","w","w","w","w","w","w",0,null,null,"w","w","w","w","w","w","w","w","w","w",0,null,null,"w","w","w","w","w","w","w",3,3,3,3,null,null,"x",3,3,"w","w","w","w","w","w","w",3,null,null,"x","w","x","w","w","x","x","w","o","w",5,null,null,"x","w","w","w","w","o","w","w","w","w",2]
[null,null,"w","x","w","w","x","w","w","w","w",2,3,null,null,"w","w","w","w",4,"w","w","w","w","w",1,null,null,"x","w","w","w","w","w","w",3,"w","w",2,null,null,"w","w","w","w","w","r","x",4,4,"w",4,null,null,"w","w","w","w","w","w","w","w","w","w",0,null,null,"w","w","w","w","w","w","x","w","w","w",1,null,null,"x","w","x","w","w","w","w","w","w","w",2,null,null,"q","w","x","w","w","w","w","w","w","w",2]
[null,null,"w","w","w","w","w","w","u","w","w",2,2,null,null,"w","w","w","w","o","w","w","w","w","w",1,null,null,"x","w","w","w","u","w","w",3,"w","w",3,null,null,"x","x","w","w","w","w","w","w","w","w",2,null,null,"w","w","w","w","w","w","w","w","r","l",2,null,null,"w","w","r","x","w","w","x","w","w","w",3,null,null,"x","w","x","w","w","w","x","w","w","x",4,null,null,"x","w","w","w","x","w","w","w",4,"w",3]
[null,null,3,"w","w","k","w","w","x","w","w","w",3,null,null,"x","w","w","w","w","w","w","w","x","x",3,null,null,"w","w","w","w","o","w","w",3,"w","w",2,null,null,"w","w","w","w",3,"w","w","x","w","x",3,null,null,3,"w","u","w","w","x","w","w","w","w",3,null,null,"w","w","w","w","w","w","x","w","w","w",1,null,null,"w","w","w","w","w","w","x","w","w","w",1,null,null,"w","w","w","w","x","w","x","w",4,"w",3]
[null,null,"x","w","w","w","w","w","w","w","x","w",2,null,null,"x","w","w","w","x","w","k","w","w","w",3,null,null,"w","w","w","w","w","w","w","w","w","w",0,null,null,"w","w","w","w",3,"w","w","w","w","w",1,null,null,3,"w","o","w","w","w","w","w","w","w",2,null,null,"w","w","w","x","w","w","x","w","w","w",2,null,null,"w","w","w","w","w","w","x","w","w","w",1,null,null,"w","x","w","w","w","w","w","w",4,"w",2]
[null,null,"o","w","w","w","x","l","w","w","w","w",3,null,null,"w","w","w","w","x","w","w","w","w","w",1,null,null,"w","w","w","k","w","w","x","w","w","w",2,null,null,"w","w","w","w",3,"w","r","x","w","w",3,null,null,3,"w","w","w","w","w","w","w","w","w",1,null,null,"r","l","w","w","w","w","w","w","w","w",2,null,null,"w","w","w","x","w","w","x","w","w","x",3,null,null,"w","w","w","w","w","w","w","w","o","w",1]
[null,{"$f":"SUM(C224:L224)","v":20},3,1,0,1,3,3,4,2,1,2,{"$f":"SUM(M214:M223)","v":20},null,{"$f":"SUM(P224:Y224)","v":20},2,3,0,1,6,0,1,2,2,3,{"$f":"SUM(Z214:Z223)","v":20},null,{"$f":"SUM(AC224:AL224)","v":20},4,1,1,2,2,1,2,5,1,1,{"$f":"SUM(AM214:AM223)","v":20},null,{"$f":"SUM(AP224:AY224)","v":20},1,2,0,1,6,2,2,4,1,1,{"$f":"SUM(AZ214:AZ223)","v":20},null,{"$f":"SUM(BC224:BL224)","v":20},4,2,2,2,0,2,1,2,3,2,{"$f":"SUM(BM214:BM223)","v":20},null,{"$f":"SUM(BP224:BY224)","v":20},3,4,3,2,0,0,5,1,0,2,{"$f":"SUM(BZ214:BZ223)","v":20},null,{"$f":"SUM(CC224:CL224)","v":20},3,0,5,1,0,2,5,0,2,2,{"$f":"SUM(CM214:CM223)","v":20},null,{"$f":"SUM(CP224:CY224)","v":20},4,3,1,0,2,3,1,0,5,1,{"$f":"SUM(CZ214:CZ223)","v":20}]
[]
[null,null,"Tagi, 05.08.21",null,null,null,null,null,null,null,null,null,null,null,null,"Tagi, 06.08.21",null,null,null,null,null,null,null,null,null,null,null,null,"Tagi, 07.08.21",null,null,null,null,null,null,null,null,null,null,null,null,"Tagi, 09.08.21",null,null,null,null,null,null,null,null,null,null,null,null,"Tagi, 10.08.21",null,null,null,null,null,null,null,null,null,null,null,null,"Tagi, 11.08.21",null,null,null,null,null,null,null,null,null,null,null,null,"Migros-Magazin, 12.08.21",null,null,null,null,null,null,null,null,null,null,null,null,"Tagi, 12.08.21"]
[null,73,"w",null,null,null,null,null,null,null,null,null,3,null,74,null,null,null,null,null,null,null,null,null,null,1,null,75,null,null,null,null,null,null,null,null,null,null,1,null,76,null,null,null,null,null,"k",null,null,null,null,2,null,77,null,null,"k",null,null,null,null,null,null,null,2,null,78,null,null,null,null,null,"r",null,null,null,null,3,null,79,null,null,null,null,null,null,null,null,null,"w",1,null,80,null,null,null,null,null,null,null,null,null,null,3]
[null,"Tagi, 05.08.21",null,null,null,null,null,null,null,null,"u",null,2,null,"Tagi, 06.08.21",null,null,null,null,null,null,null,null,null,null,0,null,"Tagi, 07.08.21",null,null,null,null,null,null,null,null,null,null,6,null,"Tagi, 09.08.21",null,null,null,null,null,null,null,null,null,null,0,null,"Tagi, 10.08.21",null,null,null,null,null,null,null,null,null,null,2,null,"Tagi, 11.08.21",null,null,null,null,null,null,null,null,null,null,1,null,"Migros-Magazin, 12.08.21",null,null,null,null,null,null,null,null,null,null,4,null,"Tagi, 12.08.21",null,null,null,null,null,null,null,null,null,null,2]
[null,null,null,null,"q",null,null,null,null,null,null,null,2,null,null,null,null,null,null,null,null,"l",null,null,null,4,null,null,null,null,null,null,null,null,null,null,null,null,0,null,null,null,null,null,null,null,null,null,null,null,null,1,null,null,null,null,null,null,null,null,null,null,null,null,0,null,null,null,null,null,null,null,null,null,null,"l",null,3,null,null,null,null,null,null,null,null,null,null,null,null,1,null,null,null,null,null,null,null,null,"k",null,null,null,1]
[null,null,null,null,null,null,null,null,null,null,null,null,2,null,null,null,null,null,null,null,null,null,null,"r",null,2,null,null,"r",null,null,null,null,null,null,null,null,null,3,null,null,null,"l",null,null,"u",null,null,null,null,null,4,null,null,null,null,null,null,null,null,null,null,null,null,1,null,null,null,null,"k",null,null,null,null,null,null,null,2,null,null,null,null,null,null,null,null,null,null,null,null,0,null,null,null,null,null,null,null,null,null,null,null,null,2]
[null,null,null,null,null,null,null,null,null,null,null,null,1,null,null,null,null,null,null,null,null,null,null,null,null,1,null,null,null,null,null,null,null,null,null,null,null,null,2,null,null,null,null,null,null,null,null,null,null,null,null,2,null,null,null,null,null,null,null,null,null,null,null,null,3,null,null,null,null,null,null,null,null,null,null,null,null,2,null,null,null,null,null,null,null,null,null,null,null,null,3,null,null,"o",null,null,null,null,null,null,null,null,null,1]
[null,null,null,null,null,null,null,null,null,null,null,null,2,null,null,null,null,null,"u",null,null,null,null,null,null,3,null,null,null,"l",null,null,null,null,null,null,null,null,3,null,null,null,null,null,null,null,null,null,null,null,null,2,null,null,null,null,null,null,null,null,null,null,null,null,2,null,null,null,null,null,null,null,null,null,null,null,null,1,null,null,null,null,null,null,null,null,null,null,null,null,3,null,null,null,null,null,null,null,null,null,null,null,null,5]
[null,null,null,null,null,null,null,null,null,null,null,null,0,null,null,null,null,null,null,null,null,null,"k",null,null,2,null,null,null,null,null,null,null,null,null,null,null,null,0,null,null,null,null,null,null,null,null,null,null,null,null,1,null,null,null,null,null,null,null,null,"u",null,"w",null,2,null,null,null,null,null,null,null,null,null,null,null,null,0,null,null,null,null,null,null,null,null,null,null,null,null,2,null,null,null,null,null,null,null,null,null,null,null,null,1]
[null,null,null,null,null,null,null,null,null,null,null,null,3,null,null,null,null,null,null,null,null,null,null,null,null,1,null,null,null,null,"k",null,null,null,null,null,null,null,2,null,null,null,null,null,null,null,null,null,null,null,null,5,null,null,null,"w",null,null,null,null,null,null,null,null,5,null,null,null,null,null,null,null,null,null,"r",null,null,2,null,null,null,null,null,null,"r",null,null,null,null,null,2,null,null,null,null,null,null,null,null,null,null,null,null,0]
[null,null,null,null,null,null,null,null,null,null,null,null,0,null,null,null,null,null,null,null,null,null,null,null,null,2,null,null,null,null,null,null,null,null,null,null,null,null,2,null,null,null,null,null,null,null,null,null,null,null,null,1,null,null,null,null,null,null,null,null,null,null,null,null,0,null,null,null,null,null,null,null,null,null,null,null,null,0,null,null,null,"k",null,null,null,null,null,null,null,null,2,null,null,null,null,"r",null,null,null,"u",null,null,null,4]
[null,null,null,null,"k",null,null,null,null,null,null,null,5,null,null,null,null,null,null,null,null,null,null,null,null,4,null,null,null,null,null,null,null,null,null,null,null,null,1,null,null,null,null,null,null,null,null,null,null,"l",null,2,null,null,null,null,null,null,null,null,null,null,null,null,3,null,null,null,null,null,null,null,null,null,null,null,null,6,null,null,null,null,null,null,"l",null,null,null,null,null,2,null,null,null,null,null,null,null,null,null,null,null,null,1]
[null,{"$f":"SUM(C237:L237)","v":20},1,0,4,1,2,3,4,0,4,1,{"$f":"SUM(M227:M236)","v":20},null,{"$f":"SUM(P237:Y237)","v":20},4,0,1,6,2,1,1,2,1,2,{"$f":"SUM(Z227:Z236)","v":20},null,{"$f":"SUM(AC237:AL237)","v":20},3,2,1,2,1,2,1,0,7,1,{"$f":"SUM(AM227:AM236)","v":20},null,{"$f":"SUM(AP237:AY237)","v":20},1,2,2,0,5,1,0,2,3,4,{"$f":"SUM(AZ227:AZ236)","v":20},null,{"$f":"SUM(BC237:BL237)","v":20},2,1,2,4,0,3,2,1,4,1,{"$f":"SUM(BM227:BM236)","v":20},null,{"$f":"SUM(BP237:BY237)","v":20},6,0,2,1,2,2,2,2,2,1,{"$f":"SUM(BZ227:BZ236)","v":20},null,{"$f":"SUM(CC237:CL237)","v":20},3,2,0,1,3,4,1,2,3,1,{"$f":"SUM(CM227:CM236)","v":20},null,{"$f":"SUM(CP237:CY237)","v":20},2,2,2,1,2,2,5,2,0,2,{"$f":"SUM(CZ227:CZ236)","v":20}]
[null,null,"Lösung",null,null,null,null,null,null,null,null,null,null,null,null,"Lösung",null,null,null,null,null,null,null,null,null,null,null,null,"Lösung",null,null,null,null,null,null,null,null,null,null,null,null,"Lösung",null,null,null,null,null,null,null,null,null,null,null,null,"Lösung",null,null,null,null,null,null,null,null,null,null,null,null,"Lösung",null,null,null,null,null,null,null,null,null,null,null,null,"Lösung",null,null,null,null,null,null,null,null,null,null,null,null,"Lösung"]
[null,73,"w","w","w","w","x","x","x","w","w","w",3,null,74,"w","w","w","x","w","w","w","w","w","w",1,null,75,"x","w","w","w","w","w","w","w","w","w",1,null,76,"w","w","w","w","w","k","w","w","x","w",2,null,77,"w","w","k","w","w",2,"w","w","w","w",2,null,78,"x","w","w","w","w","r","x","w","w","w",3,null,79,"w","x","w","w","w","w","w","w","w","w",1,null,80,"w","w","w","w","w","x","x","x","w","w",3]
[null,"Tagi, 05.08.21","w","w","x","w","w","w","w","w","u","w",2,null,"Tagi, 06.08.21","w","w","w","w","w","w","w","w","w","w",0,null,"Tagi, 07.08.21","w","w","w",4,4,4,4,"w",2,2,6,null,"Tagi, 09.08.21","w","w","w","w","w","w","w","w","w","w",0,null,"Tagi, 10.08.21","w","w","w","w","w",2,"w","x","w","w",2,null,"Tagi, 11.08.21","x","w","w","w","w","w","w","w","w","w",1,null,"Migros-Magazin, 12.08.21","w","w","w","w","x","x",4,4,"w","w",4,null,"Tagi, 12.08.21","w",2,2,"w","w","w","w","w","w","w",2]
[null,null,"w","w","q","w","w","w","w","w",4,"w",2,null,null,"w","w","w","x","x","x","x","w","w","w",4,null,null,"w","w","w","w","w","w","w","w","w","w",0,null,null,"w","w","w","w","w","w","w","w","w","x",1,null,null,"w","w","w","w","w","w","w","w","w","w",0,null,null,"w","w","w","w","w","w",3,3,3,"w",3,null,null,"w","w","w","w","w","w","w","w","w","x",1,null,null,"w","w","w","w","w","w","k","w","w","w",1]
[null,null,"w","w","x","w","w","w","w","w",4,"w",2,null,null,"w","w","w","w","w","w","w","w","r","l",2,null,null,"r","x","w","w","w","w","w","w",3,"w",3,null,null,"x","l","w","w","x","w","w","w","w",3,4,null,null,"w","w","w","w","w","w","w","w",3,"w",1,null,null,3,"w","k","w","w","w","w","w","w","w",2,null,null,"w","w","w","w","w","w","w","w","w","w",0,null,null,"u","w","w","w","w","w","w","w","w","x",2]
[null,null,"w","w","w","w","w","w","w","w",4,"w",1,null,null,"x","w","w","w","w","w","w","w","w","w",1,null,null,"w","w","w","x","w","w","w","w",3,"w",2,null,null,"w","w","w","w","x","w","w","w","w",3,2,null,null,"w","w","w",4,"w","x","w","w",3,"w",3,null,null,3,"w","w","w","x","w","w","w","w","w",2,null,null,3,"w","w","w","w","x","w","w",3,"w",3,null,null,"o","w","w","w","w","w","w","w","w","w",1]
[null,null,"w","w","w","w","w","x","x","w","w","w",2,null,null,"x","w","w","u","w","w","w","w","w","x",3,null,null,"x","l","w","w","w","w","w","w",3,"w",3,null,null,"w","w","x","w","x","w","w","w","w","w",2,null,null,"w","w","w",4,"w","w","w","w",3,"w",2,null,null,3,"w","w","w","w","w","w","w","w","w",1,null,null,3,"w","w","w","w","x","w","w",3,"w",3,null,null,"w","w","w","w",4,4,4,4,"w","x",5]
[null,null,"w","w","w","w","w","w","w","w","w","w",0,null,null,"w","w","w","x","w","w","w","k","w","w",2,null,null,"w","w","w","w","w","w","w","w","w","w",0,null,null,"w","w","w","w","x","w","w","w","w","w",1,null,null,"w","w","w",4,"w","w","u","w","w","w",2,null,null,"w","w","w","w","w","w","w","w","w","w",0,null,null,3,"w","w","w","w","w","w","w",3,"w",2,null,null,"w","x","w","w","w","w","w","w","w","w",1]
[null,null,"w","w","w","x","x","w","x","w","w","w",3,null,null,"w","w","w",3,"w","w","w","w","w","w",1,null,null,"w","w","k","w","w","w","w","w",3,"w",2,null,null,"w","x","x","w","w","w","w","x","x","x",5,null,null,"x","w","w","x","w","w","o","w","x","x",5,null,null,"w","w","w","w","w","w","w","r","l","w",2,null,null,"w","w","w","w","r","l","w","w","w","w",2,null,null,"w","w","w","w","w","w","w","w","w","w",0]
[null,null,"w","w","w","w","w","w","w","w","w","w",0,null,null,"x","w","w","w","w","w","w","x","w","w",2,null,null,"w","w","w","w","w","x","w","w",3,"w",2,null,null,"w","w","w","w","x","w","w","w","w","w",1,null,null,"w","w","w","w","w","w","w","w","w","w",0,null,null,"w","w","w","w","w","w","w","w","w","w",0,null,null,"w","k","w","w","w","w","w","x","w","w",2,null,null,"w","w",3,3,3,"w","u","w","w","w",4]
[null,null,"x","w","k","w","w",2,"x","w","w","x",5,null,null,"x","w",3,3,3,"w","w","w","w","w",4,null,null,"w","w","w","w","w","w","w","w",3,"w",1,null,null,"w","w","w","w","w","w","w","r","l","w",2,null,null,3,3,3,"w","w","w","w","w","w","w",3,null,null,"x","w","x","x","x","x","w","w","w","x",6,null,null,"w","w","w","r","l","w","w","w","w","w",2,null,null,"w","w","w","w","w","w","x","w","w","w",1]
[null,{"$f":"SUM(C249:L249)","v":20},1,0,4,1,2,3,4,0,4,1,{"$f":"SUM(M239:M248)","v":20},null,{"$f":"SUM(P249:Y249)","v":20},4,0,1,6,2,1,1,2,1,2,{"$f":"SUM(Z239:Z248)","v":20},null,{"$f":"SUM(AC249:AL249)","v":20},3,2,1,2,1,2,1,0,7,1,{"$f":"SUM(AM239:AM248)","v":20},null,{"$f":"SUM(AP249:AY249)","v":20},1,2,2,0,5,1,0,2,3,4,{"$f":"SUM(AZ239:AZ248)","v":20},null,{"$f":"SUM(BC249:BL249)","v":20},2,1,2,4,0,3,2,1,4,1,{"$f":"SUM(BM239:BM248)","v":20},null,{"$f":"SUM(BP249:BY249)","v":20},6,0,2,1,2,2,2,2,2,1,{"$f":"SUM(BZ239:BZ248)","v":20},null,{"$f":"SUM(CC249:CL249)","v":20},3,2,0,1,3,4,1,2,3,1,{"$f":"SUM(CM239:CM248)","v":20},null,{"$f":"SUM(CP249:CY249)","v":20},2,2,2,1,2,2,5,2,0,2,{"$f":"SUM(CZ239:CZ248)","v":20}]
[]
[null,null,"Tagi, 13.08.21",null,null,null,null,null,null,null,null,null,null,null,null,"Tagi, 14.08.21",null,null,null,null,null,null,null,null,null,null,null,null,"Beobachter, 13.08.21",null,null,null,null,null,null,null,null,null,null,null,null,"Tagi, 16.08.21",null,null,null,null,null,null,null,null,null,null,null,null,"Migros-Magazin, 16.08.21",null,null,null,null,null,null,null,null,null,null,null,null,"Tagi, 17.08.21",null,null,null,null,null,null,null,null,null,null,null,null,"Tagi, 18.08.21",null,null,null,null,null,null,null,null,null,null,null,null,"Tagi, 19.08.21"]
[null,81,null,null,null,null,null,null,null,null,null,null,1,null,82,null,null,null,null,null,null,null,null,null,null,6,null,83,null,null,null,null,null,null,null,null,null,null,0,null,84,null,null,null,null,null,null,null,null,"r",null,3,null,85,null,null,null,null,null,null,null,null,null,null,3,null,86,null,null,null,null,null,null,null,null,null,null,1,null,87,null,null,null,null,null,null,null,null,null,null,1,null,88,"k",null,null,null,null,null,null,null,null,null,5]
[null,"Tagi, 13.08.21",null,null,null,null,null,null,null,null,null,null,2,null,"Tagi, 14.08.21",null,null,null,null,null,null,null,null,null,null,0,null,"Beobachter, 13.08.21",null,null,null,null,null,null,null,null,null,null,0,null,"Tagi, 16.08.21","w",null,null,null,null,null,null,null,null,null,4,null,"Migros-Magazin, 16.08.21",null,null,null,"u",null,null,null,null,null,null,2,null,"Tagi, 17.08.21",null,null,null,null,null,null,"q",null,null,null,3,null,"Tagi, 18.08.21",null,null,null,null,null,null,null,null,null,null,0,null,"Tagi, 19.08.21",null,null,null,null,null,null,null,null,null,null,1]
[null,null,null,null,null,null,null,null,null,null,null,null,2,null,null,null,null,null,null,null,null,null,null,null,null,1,null,null,null,null,null,"l",null,null,null,null,null,null,2,null,null,null,null,null,null,null,null,null,null,null,null,0,null,null,"w",null,null,null,null,null,null,null,null,null,2,null,null,null,"l",null,null,null,null,null,null,null,null,3,null,null,null,null,null,null,null,null,null,null,null,null,7,null,null,"r",null,null,null,null,null,null,"k",null,null,3]
[null,null,null,null,null,null,null,null,null,"l",null,null,5,null,null,null,null,null,"o",null,null,null,null,null,null,2,null,null,null,null,null,null,null,null,null,null,null,null,2,null,null,null,"w",null,null,null,null,null,null,null,null,3,null,null,null,null,null,null,null,null,"k",null,null,null,2,null,null,null,null,null,null,null,null,null,null,null,null,2,null,null,null,null,null,null,null,null,null,null,null,null,0,null,null,null,null,null,null,null,null,null,null,null,null,0]
[null,null,null,null,null,null,null,null,null,null,null,null,0,null,null,null,null,null,null,null,null,null,null,null,null,4,null,null,null,null,null,null,null,null,null,null,null,null,3,null,null,null,null,null,null,null,null,null,null,null,null,0,null,null,null,null,null,null,null,null,null,null,null,null,1,null,null,null,null,null,null,null,null,null,null,null,null,3,null,null,null,null,null,null,null,null,null,null,null,null,1,null,null,null,null,null,null,null,null,null,null,null,null,2]
[null,null,null,null,null,null,null,null,null,null,null,null,1,null,null,null,null,null,null,null,null,null,null,null,null,2,null,null,null,null,null,null,null,null,null,null,null,null,4,null,null,null,null,null,null,null,null,null,null,null,null,3,null,null,null,null,null,null,null,null,null,null,null,null,1,null,null,null,null,null,null,null,null,"o",null,null,null,2,null,null,null,null,null,null,null,null,"u",null,null,null,3,null,null,null,null,null,null,null,null,null,null,null,null,1]
[null,null,null,null,null,null,null,"r",null,null,null,null,2,null,null,null,null,null,null,null,null,null,null,null,null,0,null,null,null,null,null,null,null,null,null,null,null,null,2,null,null,null,null,null,null,null,null,"r",null,null,null,2,null,null,null,null,null,null,null,null,null,null,null,null,5,null,null,null,null,null,"o",null,null,null,null,null,null,1,null,null,null,null,null,null,"o",null,null,null,null,null,4,null,null,null,null,null,null,null,null,"r",null,null,null,4]
[null,null,null,null,null,null,null,null,null,null,null,null,5,null,null,null,"u",null,null,null,null,null,null,null,null,1,null,null,null,null,null,null,"k",null,null,null,null,null,1,null,null,null,null,null,null,null,null,null,null,null,null,0,null,null,null,null,null,null,null,null,null,null,null,null,0,null,null,null,null,null,null,null,null,null,null,null,null,0,null,null,"u",null,null,null,null,null,null,null,null,null,2,null,null,null,null,null,null,null,null,null,null,null,null,1]
[null,null,null,null,null,null,null,null,null,null,null,null,0,null,null,null,null,null,null,null,null,"u",null,null,null,2,null,null,null,null,null,null,null,null,null,null,null,null,2,null,null,null,null,null,null,null,null,null,null,null,null,3,null,null,null,null,null,null,null,null,null,null,null,null,2,null,null,null,null,null,null,null,null,null,null,null,null,2,null,null,null,null,null,null,null,null,null,null,null,null,1,null,null,null,null,null,null,null,null,null,null,null,null,2]
[null,null,null,null,null,null,null,null,null,null,null,null,2,null,null,null,null,null,null,null,null,null,null,null,null,2,null,null,null,null,null,null,null,null,null,null,null,null,4,null,null,null,null,null,null,null,null,null,null,null,null,2,null,null,null,null,"w",null,null,null,null,null,null,null,2,null,null,null,null,null,null,null,null,null,null,null,null,3,null,null,null,null,null,null,null,null,null,null,null,null,1,null,null,null,null,null,null,null,null,null,null,null,null,1]
[null,{"$f":"SUM(C262:L262)","v":20},1,3,4,0,2,2,2,3,1,2,{"$f":"SUM(M252:M261)","v":20},null,{"$f":"SUM(P262:Y262)","v":20},1,2,1,4,1,2,3,1,0,5,{"$f":"SUM(Z252:Z261)","v":20},null,{"$f":"SUM(AC262:AL262)","v":20},0,0,4,2,4,1,2,2,4,1,{"$f":"SUM(AM252:AM261)","v":20},null,{"$f":"SUM(AP262:AY262)","v":20},4,2,3,1,1,2,4,1,1,1,{"$f":"SUM(AZ252:AZ261)","v":20},null,{"$f":"SUM(BC262:BL262)","v":20},2,1,2,2,0,3,2,1,5,2,{"$f":"SUM(BM252:BM261)","v":20},null,{"$f":"SUM(BP262:BY262)","v":20},1,5,0,4,1,1,4,3,0,1,{"$f":"SUM(BZ252:BZ261)","v":20},null,{"$f":"SUM(CC262:CL262)","v":20},2,3,3,1,2,1,4,1,1,2,{"$f":"SUM(CM252:CM261)","v":20},null,{"$f":"SUM(CP262:CY262)","v":20},3,3,0,0,5,0,1,4,2,2,{"$f":"SUM(CZ252:CZ261)","v":20}]
[null,null,"Lösung",null,null,null,null,null,null,null,null,null,null,null,null,"Lösung",null,null,null,null,null,null,null,null,null,null,null,null,"Lösung",null,null,null,null,null,null,null,null,null,null,null,null,"Lösung",null,null,null,null,null,null,null,null,null,null,null,null,"Lösung",null,null,null,null,null,null,null,null,null,null,null,null,"Lösung",null,null,null,null,null,null,null,null,null,null,null,null,"Lösung",null,null,null,null,null,null,null,null,null,null,null,null,"Lösung"]
[null,81,"w","w","w","w","w","w","w",2,"w","w",1,null,82,"x","w","x","x","x","x","w","w","w","x",6,null,83,"w","w","w","w","w","w","w","w","w","w",0,null,84,"x","w","w","w","w","w","w","w","r","x",3,null,85,"w","w","w","w","w","w","w",3,3,3,3,null,86,"w","x","w","w","w","w","w","w","w","w",1,null,87,"w","x","w","w","w","w","w","w","w","w",1,null,88,"k","w","w","w","x","w","w","x","x","x",5]
[null,"Tagi, 13.08.21","w","w",3,"w","w","w","w",2,"w","w",2,null,"Tagi, 14.08.21","w","w","w","w","w","w","w","w","w","w",0,null,"Beobachter, 13.08.21","w","w","w","w","w","w","w","w","w","w",0,null,"Tagi, 16.08.21","w","w","w",4,4,4,"x","w","w","w",4,null,"Migros-Magazin, 16.08.21","x","w","w","u","w","w","w","w","w","w",2,null,"Tagi, 17.08.21","w","w","w","w","w",3,3,"x","w","w",3,null,"Tagi, 18.08.21","w","w","w","w","w","w","w","w","w","w",0,null,"Tagi, 19.08.21","w","w","w","w","x","w","w","w","w","w",1]
[null,null,"w","w",3,"w","w","w","w","w","w","x",2,null,null,"w","w","w","x","w","w","w","w","w","w",1,null,null,"w","w","r","l","w","w","w","w","w","w",2,null,null,"w","w","w","w","w","w","w","w","w","w",0,null,null,"w","w","w","o","w","w","w","w","x","w",2,null,null,"x","l","w","w","w","w","w","w","w","x",3,null,null,"w","x","x","x","w","x",4,4,4,"w",7,null,null,"r","x","w","w","w","w","w","k","w","w",3]
[null,null,"w","w","x","w",4,4,4,4,"w","w",5,null,null,"w","w","w","o","w","w","w","w","w","x",2,null,null,"w","w","w","w","w","w","x","w","x","w",2,null,null,"x","w","x","w","w","w","x","w","w","w",3,null,null,"w","w","w","w","w","w","k","w","x","w",2,null,null,"w","w","w",4,"w","w","x","w","w","w",2,null,null,"w","w","w","w","w","w","w","w","w","w",0,null,null,"w","w","w","w","w","w","w","w","w","w",0]
[null,null,"w","w","w","w","w","w","w","w","w","w",0,null,null,"w","w","w","w","w",3,3,3,"w","x",4,null,null,"w","w","x","w","x","w","w","w","x","w",3,null,null,"w","w","w","w","w","w","w","w","w","w",0,null,null,"w","w","w","w","w","w","w","w","x","w",1,null,null,"w","x","w",4,"w","w","x","w","w","w",3,null,null,"w","x","w","w","w","w","w","w","w","w",1,null,null,"w","x","w","w","w","w","w","x","w","w",2]
[null,null,"w","x","w","w","w","w","w","w","w","w",1,null,null,"w","w","w","x","w","w","w","w","w","x",2,null,null,"w","w","x","w","x","w","x","w","x","w",4,null,null,"x","x","x","w","w","w","w","w","w","w",3,null,null,"w","w","w","w","w","w","w","w","x","w",1,null,null,"w","w","w","x","w","w","o","w","w","w",2,null,null,"w","w","w","w","u","w",3,"w","w","x",3,null,null,"w","x","w","w","w","w","w","w","w","w",1]
[null,null,"w","w","w","w","w","r","l","w","w","w",2,null,null,"w","w","w","w","w","w","w","w","w","w",0,null,null,"w","w","x","w","w","w","w","w","x","w",2,null,null,"w","w","w","w","w","w","r","l","w","w",2,null,null,"x","x","x","w","w","x","x","w","w","w",5,null,null,"w","w","w","o","w","w","w","w","w","w",1,null,null,"w","w","x","w","o","w",3,"w","w","x",4,null,null,"w","w","w","w","w","w",4,4,4,4,4]
[null,null,"x","x","x","w","w","w","w","w","x","x",5,null,null,"w","u","w","w","w","w","w","w","w","w",1,null,null,"w","w","w","w","k","w","w","w","w","w",1,null,null,"w","w","w","w","w","w","w","w","w","w",0,null,null,"w","w","w","w","w","w","w","w","w","w",0,null,null,"w","w","w","w","w","w","w","w","w","w",0,null,null,"u","w","w","w","w","w",3,"w","w","w",2,null,null,"w","w","w","w",3,"w","w","w","w","w",1]
[null,null,"w","w","w","w","w","w","w","w","w","w",0,null,null,"w","o","w","w","w","w","u","w","w","w",2,null,null,"w","w","w","w","w","w","w","x","w","x",2,null,null,3,3,3,"w","w","w","w","w","w","w",3,null,null,"w","w","x","w","w",2,"w","w","w","w",2,null,null,"w","x","w","w","w","w","w","x","w","w",2,null,null,"o","w","w","w","w","w","w","w","w","w",1,null,null,"x","w","w","w",3,"w","w","w","w","w",2]
[null,null,"w","x","w","w","x","w","w","w","w","w",2,null,null,"w","w","w","w","w","w","x","w","w","x",2,null,null,"w","w","w","x","x","x","w","x","w","w",4,null,null,"w","w","w","w","w","x","x","w","w","w",2,null,null,"w","w","w","w","w",2,"w","w","w","x",2,null,null,"w","x","w","w","x","w","w","x","w","w",3,null,null,"w","w","x","w","w","w","w","w","w","w",1,null,null,"w","w","w","w",3,"w","w","w","w","w",1]
[null,{"$f":"SUM(C274:L274)","v":20},1,3,4,0,2,2,2,3,1,2,{"$f":"SUM(M264:M273)","v":20},null,{"$f":"SUM(P274:Y274)","v":20},1,2,1,4,1,2,3,1,0,5,{"$f":"SUM(Z264:Z273)","v":20},null,{"$f":"SUM(AC274:AL274)","v":20},0,0,4,2,4,1,2,2,4,1,{"$f":"SUM(AM264:AM273)","v":20},null,{"$f":"SUM(AP274:AY274)","v":20},4,2,3,1,1,2,4,1,1,1,{"$f":"SUM(AZ264:AZ273)","v":20},null,{"$f":"SUM(BC274:BL274)","v":20},2,1,2,2,0,3,2,1,5,2,{"$f":"SUM(BM264:BM273)","v":20},null,{"$f":"SUM(BP274:BY274)","v":20},1,5,0,4,1,1,4,3,0,1,{"$f":"SUM(BZ264:BZ273)","v":20},null,{"$f":"SUM(CC274:CL274)","v":20},2,3,3,1,2,1,4,1,1,2,{"$f":"SUM(CM264:CM273)","v":20},null,{"$f":"SUM(CP274:CY274)","v":20},3,3,0,0,5,0,1,4,2,2,{"$f":"SUM(CZ264:CZ273)","v":20}]
[]
[null,null,"Tagi, 20.08.21",null,null,null,null,null,null,null,null,null,null,null,null,"Tagi, 21.08.21",null,null,null,null,null,null,null,null,null,null,null,null,"Tagi, 23.08.21",null,null,null,null,null,null,null,null,null,null,null,null,"Tagi, 24.08.21",null,null,null,null,null,null,null,null,null,null,null,null,"Migros-Magazin, 23.08.21",null,null,null,null,null,null,null,null,null,null,null,null,"Tagi, 25.08.21",null,null,null,null,null,null,null,null,null,null,null,null,"Tagi, 26.08.21",null,null,null,null,null,null,null,null,null,null,null,null,"Tagi, 27.08.21"]
[null,89,null,null,null,null,"k",null,null,null,null,null,3,null,90,null,null,null,null,null,null,null,null,null,null,2,null,91,null,null,"u",null,null,null,null,null,null,null,1,null,92,null,null,null,null,null,null,null,null,null,null,2,null,93,null,null,null,"k",null,null,null,null,"l",null,5,null,94,null,null,null,null,null,null,null,null,"u",null,2,null,95,"k",null,null,null,null,null,null,null,null,null,3,null,96,null,null,null,null,null,null,null,null,"k",null,1]
[null,"Tagi, 20.08.21",null,null,null,null,null,null,null,null,null,null,4,null,"Tagi, 21.08.21",null,null,null,null,null,null,null,null,"o",null,3,null,"Tagi, 23.08.21",null,null,null,null,null,null,null,null,null,null,1,null,"Tagi, 24.08.21",null,null,null,null,"k",null,null,null,null,null,1,null,"Migros-Magazin, 23.08.21",null,null,null,null,null,null,null,null,null,null,0,null,"Tagi, 25.08.21",null,null,null,null,null,null,null,null,null,null,3,null,"Tagi, 26.08.21",null,null,null,null,null,null,null,null,"o",null,1,null,"Tagi, 27.08.21",null,null,null,null,null,null,null,null,null,null,3]
[null,null,null,null,null,null,null,null,null,null,null,null,2,null,null,null,null,null,null,null,null,null,null,null,null,2,null,null,null,null,null,null,null,"q",null,null,null,null,3,null,null,null,null,null,null,null,null,null,null,"l",null,4,null,null,null,null,null,null,null,null,"l",null,null,null,2,null,null,null,null,null,null,null,null,null,null,null,null,3,null,null,null,null,"u",null,null,null,"k",null,null,null,3,null,null,null,null,null,null,null,null,null,null,null,null,1]
[null,null,null,null,null,null,null,null,null,null,null,null,4,null,null,null,null,null,null,null,null,null,"k",null,null,1,null,null,null,null,null,null,null,null,null,null,null,null,0,null,null,null,null,null,null,null,null,null,null,null,null,2,null,null,null,null,null,null,null,null,null,null,null,null,0,null,null,null,null,"q",null,null,null,null,null,null,null,2,null,null,null,null,null,null,null,null,null,null,null,null,2,null,null,null,null,null,null,null,"k",null,null,null,null,3]
[null,null,null,null,null,null,null,null,null,null,null,null,0,null,null,"k",null,null,null,null,null,null,null,null,null,1,null,null,null,null,null,null,null,null,null,null,null,null,2,null,null,null,null,null,null,null,null,null,null,null,null,0,null,null,null,null,null,null,null,null,null,null,null,null,3,null,null,null,null,null,null,null,null,null,null,null,null,2,null,null,null,null,null,null,null,null,null,null,null,null,1,null,null,null,null,null,null,null,null,null,null,"l",null,3]
[null,null,null,null,null,null,null,null,null,null,null,null,3,null,null,null,null,null,null,null,null,null,null,null,null,3,null,null,null,null,null,null,null,null,null,null,null,null,1,null,null,null,null,null,null,null,null,null,null,null,null,1,null,null,null,null,null,null,null,null,null,null,null,null,1,null,null,null,null,null,null,null,null,null,null,null,null,0,null,null,null,null,null,null,null,null,null,null,null,null,2,null,null,null,null,null,null,null,null,null,null,null,null,5]
[null,null,null,null,null,null,null,null,null,null,null,null,1,null,null,null,null,null,null,null,null,null,null,null,null,1,null,null,null,null,null,null,null,null,"o",null,"w",null,4,null,null,null,null,null,null,null,null,null,null,"k",null,2,null,null,null,null,null,null,null,null,null,null,null,null,1,null,null,null,null,null,null,null,null,null,null,null,null,2,null,null,null,null,null,null,null,null,null,null,null,null,2,null,null,null,null,null,null,null,null,null,null,null,null,0]
[null,null,null,null,null,null,null,null,null,null,"o",null,1,null,null,null,null,null,null,null,null,null,null,null,null,2,null,null,null,null,null,null,null,null,null,null,null,null,2,null,null,null,null,null,null,null,null,null,null,null,null,3,null,null,null,null,null,null,null,null,null,null,null,null,5,null,null,null,null,null,null,null,null,"q",null,null,null,3,null,null,null,null,null,null,null,null,null,null,null,null,2,null,null,null,null,null,null,null,null,null,null,null,null,1]
[null,null,null,null,null,null,null,null,null,null,null,null,0,null,null,null,null,null,null,null,null,null,null,null,null,2,null,null,null,null,null,null,null,null,null,null,null,null,3,null,null,null,null,null,null,null,null,null,null,null,null,4,null,null,null,null,null,null,null,null,null,null,"u",null,1,null,null,"o",null,null,null,null,null,null,null,null,null,2,null,null,null,null,null,null,null,null,null,null,null,null,3,null,null,null,null,null,null,null,null,null,null,null,null,2]
[null,null,null,null,null,null,null,null,null,null,null,null,2,null,null,null,null,null,"r",null,null,null,null,null,null,3,null,null,null,null,null,null,null,null,null,null,null,null,3,null,null,null,null,"k",null,null,null,null,null,null,null,1,null,null,null,null,null,null,null,null,null,null,null,null,2,null,null,null,null,null,null,null,null,null,null,null,null,1,null,null,null,null,null,null,null,null,null,null,null,null,1,null,null,null,null,null,null,"k",null,null,null,null,null,1]
[null,{"$f":"SUM(C287:L287)","v":20},2,0,1,1,3,1,6,0,2,4,{"$f":"SUM(M277:M286)","v":20},null,{"$f":"SUM(P287:Y287)","v":20},1,3,0,3,2,3,4,1,2,1,{"$f":"SUM(Z277:Z286)","v":20},null,{"$f":"SUM(AC287:AL287)","v":20},3,0,3,4,1,1,4,0,3,1,{"$f":"SUM(AM277:AM286)","v":20},null,{"$f":"SUM(AP287:AY287)","v":20},3,1,1,0,6,0,2,2,4,1,{"$f":"SUM(AZ277:AZ286)","v":20},null,{"$f":"SUM(BC287:BL287)","v":20},5,0,0,2,1,2,4,1,4,1,{"$f":"SUM(BM277:BM286)","v":20},null,{"$f":"SUM(BP287:BY287)","v":20},3,0,5,2,0,0,7,0,2,1,{"$f":"SUM(BZ277:BZ286)","v":20},null,{"$f":"SUM(CC287:CL287)","v":20},3,3,2,1,0,3,1,4,2,1,{"$f":"SUM(CM277:CM286)","v":20},null,{"$f":"SUM(CP287:CY287)","v":20},3,0,4,1,3,3,0,3,2,1,{"$f":"SUM(CZ277:CZ286)","v":20}]
[null,null,"Lösung",null,null,null,null,null,null,null,null,null,null,null,null,"Lösung",null,null,null,null,null,null,null,null,null,null,null,null,"Lösung",null,null,null,null,null,null,null,null,null,null,null,null,"Lösung",null,null,null,null,null,null,null,null,null,null,null,null,"Lösung",null,null,null,null,null,null,null,null,null,null,null,null,"Lösung",null,null,null,null,null,null,null,null,null,null,null,null,"Lösung",null,null,null,null,null,null,null,null,null,null,null,null,"Lösung"]
[null,89,2,"w","w","w","k","w","x","w","w","w",3,null,90,"w","w","w","w","w","x","w","w","u","w",2,null,91,"w","w","u","w","w","w","w","w","w","w",1,null,92,"w","w","w","w","w","w","w","w",2,2,2,null,93,"x","w","w","k","w","w","x","x","l","w",5,null,94,"w","w","w","w","w","w","x","w","u","w",2,null,95,"k","w","w","x","w","w","w","w","u","w",3,null,96,"w","w","w","w","w","w","w","w","k","w",1]
[null,"Tagi, 20.08.21",2,"w","x","w","w","w","x","w","w",3,4,null,"Tagi, 21.08.21","w","w","w","x","w","x","w","w","o","w",3,null,"Tagi, 23.08.21","w","w","x","w","w","w","w","w","w","w",1,null,"Tagi, 24.08.21","w","w","w","w","k","w","w","w","w","w",1,null,"Migros-Magazin, 23.08.21","w","w","w","w","w","w","w","w","w","w",0,null,"Tagi, 25.08.21","w","w","x","w","w","w","x","w","o","w",3,null,"Tagi, 26.08.21","w","w","w","w","w","w","w","w","o","w",1,null,"Tagi, 27.08.21","w","w",3,"w","x","x","w","w","w","w",3]
[null,null,"w","w","w","w","w","w","x","w","w",3,2,null,null,"w","w","w","x","w","x","w","w","w","w",2,null,null,"w","w","w","w","x","q","x","w","w","w",3,null,null,"x","w","w","w","w","w",3,3,3,"w",4,null,null,"w","w","w","w","w","r","l","w","w","w",2,null,null,"x","w","x","w","w","w","x","w","w","w",3,null,null,"x","w","u","w","w","w","k","w","w","w",3,null,null,"w","w",3,"w","w","w","w","w","w","w",1]
[null,null,"w","w","w",2,2,"w","x","w","w","x",4,null,null,"w","w","w","w","w","w","w","k","w","w",1,null,null,"w","w","w","w","w","w","w","w","w","w",0,null,null,"x","w","w","w","x","w","w","w","w","w",2,null,null,"w","w","w","w","w","w","w","w","w","w",0,null,null,"w","w","q","w","w","w","w","w","w","x",2,null,null,"x","w","o","w","w","w","w","w","w","w",2,null,null,"x","w",3,"w","w","k","w","w","w","w",3]
[null,null,"w","w","w","w","w","w","w","w","w","w",0,null,null,"k","w","w","w","w","w","w","w","w","w",1,null,null,"w","w","x","w","w","w","w","w","x","w",2,null,null,"w","w","w","w","w","w","w","w","w","w",0,null,null,"w","w","w","w","w","w","x","w","x","x",3,null,null,"w","w","x","w","w","w","x","w","w","w",2,null,null,"w","w","w","w","w",3,"w","w","w","w",1,null,null,"x","w","w","w","w","w","w","x","l","w",3]
[null,null,"w","w","w","w",3,3,"x","w","w","w",3,null,null,"w","w","w","w","x","w","x","w","w","x",3,null,null,"w","w","w","w","w","w","x","w","w","w",1,null,null,"w","w","w","w","x","w","w","w","w","w",1,null,null,3,"w","w","w","w","w","w","w","w","w",1,null,null,"w","w","w","w","w","w","w","w","w","w",0,null,null,"w","w","w","w","w",3,"w","x","w","w",2,null,null,"x","w","x","x","x","x","w","w","w","w",5]
[null,null,"w","w","w","w","w","w","w","w","u","w",1,null,null,"w","w","w","w","w","w",4,"w","w","w",1,null,null,"x","w","w",4,"w","w","o","w","w","x",4,null,null,"w","w","w","w","x","w","w","w","k","w",2,null,null,3,"w","w","w","w","w","w","w","w","w",1,null,null,"w","w","w",2,"w","w","x","w","w","w",2,null,null,"w","w","w","w","w",3,"w","x","w","w",2,null,null,"w","w","w","w","w","w","w","w","w","w",0]
[null,null,"w","w","w","w","w","w","w","w","o","w",1,null,null,"w",3,"w","w","w","w",4,"w","w","w",2,null,null,3,"w","w",4,"w","w","w","w","w","w",2,null,null,"x","x","w","w","x","w","w","w","w","w",3,null,null,"x","w","w","x","x","x","x","w","w","w",5,null,null,"x","w","w",2,"w","w","q","w","w","w",3,null,null,"w",3,"w","w","w","w","w","x","w","w",2,null,null,"w","w","w","w","w","w","w","x","w","w",1]
[null,null,"w","w","w","w","w","w","w","w","w","w",0,null,null,"w",3,"w","w","w","w",4,"w","w","w",2,null,null,3,"w","w",4,"w","w","w","w","x","w",3,null,null,"w","w","w","w","x","w","x",3,3,"w",4,null,null,"w","w","w","w","w","w","w","w","u","w",1,null,null,"o","w","w","w","w","w","x","w","w","w",2,null,null,"w",3,"w","w","w","w","w","x","w","x",3,null,null,"w","w","w","w","w","w","w","x","w","x",2]
[null,null,"w","w","w","w","w","w","x","w","w","x",2,null,null,"w",3,"w","r","x","w","w","w","w","w",3,null,null,"w","w","w",4,"w","w","x","w","x","w",3,null,null,"w","w","k","w","w","w","w","w","w","w",1,null,null,"x","w","w","w","w","w","w","w","x","w",2,null,null,"w","w","x","w","w","w","w","w","w","w",1,null,null,"w",3,"w","w","w","w","w","w","w","w",1,null,null,"w","w","w","w","k","w","w","w","w","w",1]
[null,{"$f":"SUM(C299:L299)","v":20},2,0,1,1,3,1,6,0,2,4,{"$f":"SUM(M289:M298)","v":20},null,{"$f":"SUM(P299:Y299)","v":20},1,3,0,3,2,3,4,1,2,1,{"$f":"SUM(Z289:Z298)","v":20},null,{"$f":"SUM(AC299:AL299)","v":20},3,0,3,4,1,1,4,0,3,1,{"$f":"SUM(AM289:AM298)","v":20},null,{"$f":"SUM(AP299:AY299)","v":20},3,1,1,0,6,0,2,2,4,1,{"$f":"SUM(AZ289:AZ298)","v":20},null,{"$f":"SUM(BC299:BL299)","v":20},5,0,0,2,1,2,4,1,4,1,{"$f":"SUM(BM289:BM298)","v":20},null,{"$f":"SUM(BP299:BY299)","v":20},3,0,5,2,0,0,7,0,2,1,{"$f":"SUM(BZ289:BZ298)","v":20},null,{"$f":"SUM(CC299:CL299)","v":20},3,3,2,1,0,3,1,4,2,1,{"$f":"SUM(CM289:CM298)","v":20},null,{"$f":"SUM(CP299:CY299)","v":20},3,0,4,1,3,3,0,3,2,1,{"$f":"SUM(CZ289:CZ298)","v":20}]
[]
[null,null,"Beobachter, 27.08.21",null,null,null,null,null,null,null,null,null,null,null,null,"Tagi, 28.08.21",null,null,null,null,null,null,null,null,null,null,null,null,"Tagi, 30.08.21",null,null,null,null,null,null,null,null,null,null,null,null,"Tagi, 31.08.21",null,null,null,null,null,null,null,null,null,null,null,null,"Tagi, 01.09.21",null,null,null,null,null,null,null,null,null,null,null,null,"Tagi, 02.09.21",null,null,null,null,null,null,null,null,null,null,null,null,"Tagi, 03.09.21",null,null,null,null,null,null,null,null,null,null,null,null,"Tagi, 06.09.21"]
[null,97,null,null,null,null,null,null,null,null,null,null,0,null,98,null,null,null,null,null,null,null,null,null,null,3,null,99,null,null,null,null,null,null,null,null,null,null,1,null,100,null,null,null,null,null,null,null,null,"l",null,3,null,101,null,null,null,"u",null,null,null,null,null,null,1,null,102,null,null,null,null,null,null,null,null,null,null,3,null,103,null,null,null,null,null,null,null,null,null,null,3,null,104,null,null,null,null,null,null,null,null,null,null,1]
[null,"Beobachter, 27.08.21",null,null,null,null,null,null,null,null,null,null,0,null,"Tagi, 28.08.21",null,null,null,null,null,null,null,null,null,null,0,null,"Tagi, 30.08.21",null,null,null,null,"q",null,null,null,null,null,3,null,"Tagi, 31.08.21",null,null,null,null,null,null,null,null,null,null,1,null,"Tagi, 01.09.21",null,null,null,null,null,null,null,null,null,null,4,null,"Tagi, 02.09.21",null,null,null,null,null,null,null,null,"o",null,1,null,"Tagi, 03.09.21",null,"q",null,null,null,null,null,"q",null,null,4,null,"Tagi, 06.09.21",null,null,null,null,null,null,null,null,null,null,2]
[null,null,null,null,null,null,null,null,null,null,null,null,3,null,null,null,null,null,null,null,"q",null,null,null,null,3,null,null,null,null,null,null,null,null,null,null,null,null,3,null,null,null,"q",null,null,null,null,null,null,null,null,2,null,null,null,null,null,null,null,null,null,null,null,null,2,null,null,null,null,null,null,null,null,null,null,null,null,0,null,null,null,null,null,null,null,null,null,null,null,null,1,null,null,null,null,null,null,null,null,null,null,null,null,5]
[null,null,null,null,null,"l",null,null,null,null,null,null,2,null,null,null,null,"l",null,null,null,null,null,null,null,2,null,null,null,null,null,null,null,null,null,null,null,null,1,null,null,null,null,null,null,null,null,null,null,null,null,2,null,null,null,null,null,null,null,null,null,"k",null,null,2,null,null,null,"l",null,null,null,null,null,null,null,null,2,null,null,null,null,null,null,null,null,null,null,null,null,0,null,null,null,null,null,null,null,null,null,null,null,null,0]
[null,null,null,null,null,null,null,null,null,null,null,null,3,null,null,null,null,null,null,null,null,"k",null,null,null,3,null,null,null,null,null,null,null,null,null,"w",null,null,3,null,null,null,null,null,null,null,null,null,"o",null,null,3,null,null,null,null,null,"w",null,null,null,null,null,null,4,null,null,null,null,null,"k",null,"u",null,null,null,null,2,null,null,null,null,null,null,null,null,null,null,null,null,6,null,null,null,null,null,null,null,"k",null,null,null,null,3]
[null,null,null,null,null,null,"u",null,null,null,null,null,2,null,null,null,null,null,null,null,null,null,null,null,null,0,null,null,"u",null,null,null,null,null,null,null,null,null,1,null,null,null,null,null,null,null,null,null,null,null,null,1,null,null,null,null,null,null,null,null,null,null,null,null,0,null,null,null,null,null,null,null,null,null,null,null,null,2,null,null,null,null,null,null,null,null,null,null,null,null,0,null,null,null,null,null,null,null,null,null,null,null,null,0]
[null,null,null,null,null,null,null,null,null,null,null,null,5,null,null,null,null,null,null,null,null,null,null,null,null,1,null,null,null,null,null,null,null,null,null,null,null,null,2,null,null,null,null,null,"w",null,null,null,null,null,null,2,null,null,null,null,null,null,null,null,null,null,"q",null,4,null,null,null,null,null,null,null,null,null,null,null,null,4,null,null,null,null,null,null,null,null,null,null,null,null,2,null,null,null,null,null,null,null,null,null,null,null,null,0]
[null,null,null,null,null,null,null,null,null,null,null,null,1,null,null,null,null,null,null,null,null,null,"q",null,null,5,null,null,null,null,null,null,null,null,null,"u",null,null,3,null,null,null,null,null,null,null,null,null,null,null,null,0,null,null,null,null,null,null,null,null,null,null,null,null,1,null,null,null,null,null,null,null,null,null,null,null,null,1,null,null,null,null,null,null,"k",null,null,null,null,null,1,null,null,null,null,null,null,null,null,null,null,null,null,3]
[null,null,null,null,null,null,null,null,null,null,null,null,2,null,null,null,null,null,null,null,null,null,null,null,null,2,null,null,null,null,null,null,null,null,null,null,null,null,1,null,null,null,null,null,null,null,null,null,null,null,null,1,null,null,null,null,null,null,null,null,null,null,null,null,1,null,null,null,null,null,null,null,null,null,null,null,null,0,null,null,null,"l",null,null,null,null,null,null,null,null,2,null,null,null,null,null,null,null,"o",null,null,null,null,3]
[null,null,null,null,null,null,null,null,null,null,null,null,2,null,null,null,null,null,null,null,null,null,null,null,null,1,null,null,null,null,null,null,null,null,null,null,null,null,2,null,null,null,null,null,null,null,null,null,null,null,null,5,null,null,null,null,null,null,null,null,null,null,null,null,1,null,null,null,null,null,null,null,null,null,null,null,null,5,null,null,null,null,null,null,null,null,null,null,null,null,1,null,null,"k",null,null,null,null,null,null,"o",null,null,3]
[null,{"$f":"SUM(C312:L312)","v":20},0,0,4,1,3,0,3,4,4,1,{"$f":"SUM(M302:M311)","v":20},null,{"$f":"SUM(P312:Y312)","v":20},1,2,2,3,1,2,3,1,4,1,{"$f":"SUM(Z302:Z311)","v":20},null,{"$f":"SUM(AC312:AL312)","v":20},3,3,1,0,6,0,1,5,0,1,{"$f":"SUM(AM302:AM311)","v":20},null,{"$f":"SUM(AP312:AY312)","v":20},1,3,2,3,0,3,1,4,2,1,{"$f":"SUM(AZ302:AZ311)","v":20},null,{"$f":"SUM(BC312:BL312)","v":20},3,0,1,3,0,4,0,3,2,4,{"$f":"SUM(BM302:BM311)","v":20},null,{"$f":"SUM(BP312:BY312)","v":20},1,4,2,3,2,2,0,0,5,1,{"$f":"SUM(BZ302:BZ311)","v":20},null,{"$f":"SUM(CC312:CL312)","v":20},3,2,3,1,3,2,1,3,1,1,{"$f":"SUM(CM302:CM311)","v":20},null,{"$f":"SUM(CP312:CY312)","v":20},2,0,0,5,0,3,2,4,2,2,{"$f":"SUM(CZ302:CZ311)","v":20}]
[null,null,"Lösung",null,null,null,null,null,null,null,null,null,null,null,null,"Lösung",null,null,null,null,null,null,null,null,null,null,null,null,"Lösung",null,null,null,null,null,null,null,null,null,null,null,null,"Lösung",null,null,null,null,null,null,null,null,null,null,null,null,"Lösung",null,null,null,null,null,null,null,null,null,null,null,null,"Lösung",null,null,null,null,null,null,null,null,null,null,null,null,"Lösung",null,null,null,null,null,null,null,null,null,null,null,null,"Lösung"]
[null,97,"w","w","w","w","w","w","w","w","w","w",0,null,98,"w",2,"x","w","w","w","w","w","x","w",3,null,99,"w","w","w","w","x","w","w","w","w","w",1,null,100,"w","w","w","x","w","w","w","x","l","w",3,null,101,"w","w","w",3,"w","w","w","w","w","w",1,null,102,"w","x","w","w","x","w","w","w","x","w",3,null,103,"w","w","w","w",2,2,"w",3,"w","w",3,null,104,"w","w","w","w","w","w","x","w","w","w",1]
[null,"Beobachter, 27.08.21","w","w","w","w","w","w","w","w","w","w",0,null,"Tagi, 28.08.21","w","w","w","w","w","w","w","w","w","w",0,null,"Tagi, 30.08.21","w","x","w","w",4,"w","w","x","w","w",3,null,"Tagi, 31.08.21","w","x","w","w","w","w","w","w","w","w",1,null,"Tagi, 01.09.21","w","w","w",3,"w","x","w","x",2,"w",4,null,"Tagi, 02.09.21","w","w","w","w","w","w","w","w","o","w",1,null,"Tagi, 03.09.21","x","q","x","w","w","w","w",3,"w","w",4,null,"Tagi, 06.09.21","x","w","w","x","w","w","w","w","w","w",2]
[null,null,"w","w","w","w","w","w","x","x","x","w",3,null,null,"w","w","w","w","x","q","x","w","w","w",3,null,null,"w","x","w","w",4,"w","w","x","w","w",3,null,null,"w","q","w","x","w","w","w","w","w","w",2,null,null,"w","w","w",3,"w","x","w","w","w","w",2,null,null,"w","w","w","w","w","w","w","w","w","w",0,null,null,"w","w","w","w","w","w","w",3,"w","w",1,null,null,"w","w","w","x","w","w",4,4,4,4,5]
[null,null,"w","w","r","l","w","w","w","w","w","w",2,null,null,"w","r","l","w","w","w","w","w","w","w",2,null,null,"w","w","w","w",4,"w","w","w","w","w",1,null,null,"w","x","w","w","w","w","w","x","w","w",2,null,null,"w","w","w","w","w","x","w","k","w","w",2,null,null,"r","l","w","w","w","w","w","w","w","w",2,null,null,"w","w","w","w","w","w","w","w","w","w",0,null,null,"w","w","w","w","w","w","w","w","w","w",0]
[null,null,"w","w","w","w","w","w","x","x","x","w",3,null,null,"w","w","w","w","w","w","k","w","x","x",3,null,null,"w","w","x","w","w","w","x","w","w","x",3,null,null,"w","w","w","x","w",3,"w","o","w","w",3,null,null,"x","w","x","w","w","x","w","w","w","x",4,null,null,"w","w","w","k","w","u","w","w","w","w",2,null,null,"w","w","x","x","x","x","w","w",2,2,6,null,null,"w","w","w","w","w","k","w","w","x","x",3]
[null,null,"w","w","x","w","u","w","w","w","w","w",2,null,null,"w","w","w","w","w","w","w","w","w","w",0,null,null,"u","w","w","w","w","w","w","w","w","w",1,null,null,"w","w","w","w","w",3,"w","w","w","w",1,null,null,"w","w","w","w","w","w","w","w","w","w",0,null,null,"w","w","w","w","w","o","w","w",3,"w",2,null,null,"w","w","w","w","w","w","w","w","w","w",0,null,null,"w","w","w","w","w","w","w","w","w","w",0]
[null,null,"w","w","w","w","x","w","x","x","x","x",5,null,null,"w","w","w",3,"w","w","w","w","w","w",1,null,null,"x","w","w","w","x","w","w","w","w","w",2,null,null,"x","w","w","w","w",3,"w","w","w","w",2,null,null,"x","w","w","w","w","w","w",3,3,3,4,null,null,"w",3,3,3,"w","w","w","w",3,"w",4,null,null,"x","w","x","w","w","w","w","w","w","w",2,null,null,"w","w","w","w","w","w","w","w","w","w",0]
[null,null,"w","w","x","w","w","w","w","w","w","w",1,null,null,"w","w","w",3,"w",4,4,4,4,"w",5,null,null,"x","w","w","w","x","w","w","u","w","w",3,null,null,"w","w","w","w","w","w","w","w","w","w",0,null,null,"x","w","w","w","w","w","w","w","w","w",1,null,null,"w","w","w","w","w","w","w","w",3,"w",1,null,null,"w","w","w","w","k","w","w","w","w","w",1,null,null,"w","w","w",3,"w","x","w",3,"w","w",3]
[null,null,"w","w","w","w","w","w","w","x","x","w",2,null,null,"x","w","w",3,"w","w","w","w","w","w",2,null,null,"w","w","w","w","w","w","w","x","w","w",1,null,null,"w","w",2,"w","w","w","w","w","w","w",1,null,null,"w","w","w","w","w","w","w","w","w",2,1,null,null,"w","w","w","w","w","w","w","w","w","w",0,null,null,"r","l","w","w","w","w","w","w","w","w",2,null,null,"w","w","w",3,"w","o","w",3,"w","w",3]
[null,null,"w","w","x","w","x","w","w","w","w","w",2,null,null,"w","w","w","w","w","w","w","w","x","w",1,null,null,"w","x","w","w","w","w","w","x","w","w",2,null,null,"w","w",2,"w","w","w",4,4,4,4,5,null,null,"w","w","w","w","w","w","w","w","w",2,1,null,null,"w",4,4,4,4,"w","w","w","w","x",5,null,null,"w","w","w","w","w","w","x","w","w","w",1,null,null,"k","w","w",3,"w","w","w",3,"w","w",3]
[null,{"$f":"SUM(C324:L324)","v":20},0,0,4,1,3,0,3,4,4,1,{"$f":"SUM(M314:M323)","v":20},null,{"$f":"SUM(P324:Y324)","v":20},1,2,2,3,1,2,3,1,4,1,{"$f":"SUM(Z314:Z323)","v":20},null,{"$f":"SUM(AC324:AL324)","v":20},3,3,1,0,6,0,1,5,0,1,{"$f":"SUM(AM314:AM323)","v":20},null,{"$f":"SUM(AP324:AY324)","v":20},1,3,2,3,0,3,1,4,2,1,{"$f":"SUM(AZ314:AZ323)","v":20},null,{"$f":"SUM(BC324:BL324)","v":20},3,0,1,3,0,4,0,3,2,4,{"$f":"SUM(BM314:BM323)","v":20},null,{"$f":"SUM(BP324:BY324)","v":20},1,4,2,3,2,2,0,0,5,1,{"$f":"SUM(BZ314:BZ323)","v":20},null,{"$f":"SUM(CC324:CL324)","v":20},3,2,3,1,3,2,1,3,1,1,{"$f":"SUM(CM314:CM323)","v":20},null,{"$f":"SUM(CP324:CY324)","v":20},2,0,0,5,0,3,2,4,2,2,{"$f":"SUM(CZ314:CZ323)","v":20}]
[]
[null,null,"Tagi, 04.09.21",null,null,null,null,null,null,null,null,null,null,null,null,"Migros-Magazin, 06.09.21",null,null,null,null,null,null,null,null,null,null,null,null,"Tagi, 07.09.21",null,null,null,null,null,null,null,null,null,null,null,null,"Tagi, 08.09.21",null,null,null,null,null,null,null,null,null,null,null,null,"Tagi, 09.09.21",null,null,null,null,null,null,null,null,null,null,null,null,"Tagi, 10.09.21",null,null,null,null,null,null,null,null,null,null,null,null,"Beobachter, 10.09.21",null,null,null,null,null,null,null,null,null,null,null,null,"Tagi, 11.09.21"]
[null,105,null,null,null,null,null,null,null,null,null,null,1,null,106,null,null,null,null,"l",null,null,null,null,null,5,null,107,null,null,null,"u",null,null,null,null,null,null,2,null,108,null,null,null,null,null,null,null,null,null,null,3,null,109,null,null,null,null,null,"w",null,null,null,null,5,null,110,null,null,null,null,"u",null,null,"q",null,null,4,null,111,null,null,null,null,null,null,null,null,null,null,0,null,112,null,null,"k",null,null,null,null,null,null,null,2]
[null,"Tagi, 04.09.21",null,null,null,null,null,null,null,null,null,null,2,null,"Migros-Magazin, 06.09.21","o",null,null,null,null,null,null,null,null,null,1,null,"Tagi, 07.09.21",null,null,null,null,null,null,null,null,null,null,3,null,"Tagi, 08.09.21",null,null,null,null,null,null,null,null,null,null,0,null,"Tagi, 09.09.21","w",null,null,null,null,null,null,null,null,null,2,null,"Tagi, 10.09.21",null,null,null,null,null,null,null,null,null,null,1,null,"Beobachter, 10.09.21",null,null,null,null,null,null,null,null,null,null,0,null,"Tagi, 11.09.21",null,null,null,null,null,null,null,null,null,null,2]
[null,null,null,null,null,null,"r",null,null,null,null,null,4,null,null,null,null,null,null,null,null,null,null,null,null,4,null,null,null,null,null,null,null,null,null,null,null,null,2,null,null,null,null,null,null,null,null,null,null,null,null,1,null,null,null,null,null,null,null,null,null,null,null,null,4,null,null,null,null,null,null,null,null,null,null,null,null,4,null,null,null,null,null,null,null,null,null,null,null,null,1,null,null,null,null,null,null,null,null,null,null,null,null,4]
[null,null,null,null,null,null,null,null,null,null,null,null,1,null,null,null,null,null,null,null,null,null,null,null,null,1,null,null,null,null,null,null,null,null,null,null,null,null,2,null,null,null,null,null,null,null,null,null,null,null,null,0,null,null,null,null,null,null,null,null,null,null,"o",null,1,null,null,null,null,null,null,null,null,null,null,null,null,2,null,null,null,null,null,null,null,"r",null,null,null,null,5,null,null,null,null,null,null,null,null,null,null,null,null,0]
[null,null,null,null,null,null,null,null,null,null,null,null,4,null,null,null,null,null,null,null,null,null,null,null,null,2,null,null,null,null,null,null,null,null,null,null,null,null,0,null,null,null,null,null,null,"l",null,null,null,null,null,5,null,null,null,null,null,null,null,null,null,null,null,null,1,null,null,null,null,null,null,null,null,null,null,null,null,0,null,null,null,null,null,null,null,null,null,null,null,null,2,null,null,"k",null,null,null,null,null,null,null,null,null,3]
[null,null,null,null,null,null,null,null,null,null,null,null,0,null,null,null,null,null,null,null,null,null,null,null,null,1,null,null,null,null,null,null,null,null,null,null,"k",null,4,null,null,null,null,null,null,null,null,null,null,null,null,2,null,null,null,null,"q",null,null,null,null,null,null,null,2,null,null,null,null,null,null,null,null,null,null,null,null,0,null,null,null,null,null,null,null,null,null,null,null,null,0,null,null,null,null,null,null,null,null,null,null,null,null,2]
[null,null,null,null,null,null,null,"w",null,null,null,null,2,null,null,null,null,null,null,null,null,null,null,null,null,1,null,null,null,null,null,null,null,null,null,null,null,null,2,null,null,null,null,null,"l",null,null,null,null,null,null,5,null,null,null,null,null,null,null,null,null,null,null,null,1,null,null,null,"q",null,null,null,null,null,null,null,null,3,null,null,null,null,null,null,null,null,null,null,null,null,6,null,null,null,null,null,null,null,null,"w",null,null,null,2]
[null,null,null,null,null,null,null,null,null,"u",null,null,4,null,null,null,null,"l",null,null,null,null,null,null,null,4,null,null,null,null,null,null,null,null,"o",null,null,null,3,null,null,null,null,null,null,null,null,null,null,null,null,1,null,null,null,null,null,null,null,null,null,null,null,null,2,null,null,null,null,null,null,null,null,null,null,null,null,1,null,null,null,null,"o",null,null,null,null,null,null,null,1,null,null,null,null,null,null,null,null,null,null,null,null,0]
[null,null,null,null,null,null,null,null,null,null,null,null,1,null,null,null,null,null,null,null,null,null,null,null,null,0,null,null,null,null,null,null,null,null,null,null,null,null,0,null,null,"r",null,null,null,null,null,null,null,null,null,2,null,null,null,null,null,null,null,null,null,null,null,null,1,null,null,null,null,null,null,null,null,null,null,null,null,3,null,null,null,null,null,null,null,null,null,null,null,null,4,null,null,null,null,null,null,null,null,null,null,"l",null,2]
[null,null,null,null,null,null,null,null,null,null,null,null,1,null,null,null,null,null,null,null,null,null,null,null,null,1,null,null,null,null,null,null,null,null,null,null,null,null,2,null,null,null,null,null,null,null,null,null,null,null,null,1,null,null,null,null,null,null,null,null,null,null,null,null,1,null,null,null,null,"k",null,null,null,null,null,null,null,2,null,null,null,null,null,null,null,null,null,null,null,null,1,null,null,null,null,null,null,null,null,null,null,null,null,3]
[null,{"$f":"SUM(C337:L337)","v":20},1,5,0,0,3,5,2,2,0,2,{"$f":"SUM(M327:M336)","v":20},null,{"$f":"SUM(P337:Y337)","v":20},4,1,1,1,4,0,6,1,0,2,{"$f":"SUM(Z327:Z336)","v":20},null,{"$f":"SUM(AC337:AL337)","v":20},1,4,0,2,4,4,2,0,1,2,{"$f":"SUM(AM327:AM336)","v":20},null,{"$f":"SUM(AP337:AY337)","v":20},2,1,4,2,2,2,3,0,0,4,{"$f":"SUM(AZ327:AZ336)","v":20},null,{"$f":"SUM(BC337:BL337)","v":20},1,1,3,4,0,4,2,1,3,1,{"$f":"SUM(BM327:BM336)","v":20},null,{"$f":"SUM(BP337:BY337)","v":20},5,1,3,0,4,0,2,1,1,3,{"$f":"SUM(BZ327:BZ336)","v":20},null,{"$f":"SUM(CC337:CL337)","v":20},0,0,5,0,2,2,3,3,0,5,{"$f":"SUM(CM327:CM336)","v":20},null,{"$f":"SUM(CP337:CY337)","v":20},2,0,2,1,6,0,2,2,2,3,{"$f":"SUM(CZ327:CZ336)","v":20}]
[null,null,"Lösung",null,null,null,null,null,null,null,null,null,null,null,null,"Lösung",null,null,null,null,null,null,null,null,null,null,null,null,"Lösung",null,null,null,null,null,null,null,null,null,null,null,null,"Lösung",null,null,null,null,null,null,null,null,null,null,null,null,"Lösung",null,null,null,null,null,null,null,null,null,null,null,null,"Lösung",null,null,null,null,null,null,null,null,null,null,null,null,"Lösung",null,null,null,null,null,null,null,null,null,null,null,null,"Lösung"]
[null,105,"w","w","w","w","w","x","w","w","w","w",1,null,106,"x","w","w","x","l","w","x","w","w","x",5,null,107,"w","w","w","u","w",4,"w","w","w","w",2,null,108,"w","w","x","w","x","x","w","w","w","w",3,null,109,"w","w","w","x","w","w",4,4,4,4,5,null,110,"w","w","w","w",4,"w","x","q","x","w",4,null,111,"w","w","w","w","w","w","w","w","w","w",0,null,112,"w","w","k","w","x","w","w","w","w","w",2]
[null,"Tagi, 04.09.21","w",4,"w","w","w","w","w","w","w","x",2,null,"Migros-Magazin, 06.09.21","o","w","w","w","w","w","w","w","w","w",1,null,"Tagi, 07.09.21","w",3,"w","o","w",4,"w","w","w","w",3,null,"Tagi, 08.09.21","w","w","w","w","w","w","w","w","w","w",0,null,"Tagi, 09.09.21","w","x","w","x","w","w","w","w","w","w",2,null,"Tagi, 10.09.21","w","w","w","w",4,"w","w","w","w","w",1,null,"Beobachter, 10.09.21","w","w","w","w","w","w","w","w","w","w",0,null,"Tagi, 11.09.21","x","w","w","w","x","w","w","w","w","w",2]
[null,null,"w",4,"w","w","r","x","x","w","w","w",4,null,null,"w","w","w","w",3,"w","x","x","w","x",4,null,null,"w",3,"w","w","w",4,"w","w","w","w",2,null,null,"w","w","x","w","w","w","w","w","w","w",1,null,null,"w","w","w","x","w","x","x","w","x","w",4,null,null,"x","w","x","w",4,"w","w","w","w","x",4,null,null,"w","w","w","w","w","w","w","w","w","x",1,null,null,"w","w","w","w","w","w",4,4,4,4,4]
[null,null,"w",4,"w","w","w","w","w","w","w","w",1,null,null,"w","w","w","w",3,"w","w","w","w","w",1,null,null,"w",3,"w","w","w",4,"w","w","w","w",2,null,null,"w","w","w","w","w","w","w","w","w","w",0,null,null,"w","w","w","w","w","w","w","w","o","w",1,null,null,"x","w","w","w",4,"w","w","w","w","w",2,null,null,"w","w","x","w","w","r","x","x","w","x",5,null,null,"w","w","w","w","w","w","w","w","w","w",0]
[null,null,"w",4,"w","w","x","x","x","w","w","w",4,null,null,"w","w","w","w",3,"w",4,"w","w","w",2,null,null,"w","w","w","w","w","w","w","w","w","w",0,null,null,"w","w","x","x","l","w",3,"w","w",4,5,null,null,"w","w","x","w","w","w","w","w","w","w",1,null,null,"w","w","w","w","w","w","w","w","w","w",0,null,null,"w","w","x","w","w","w","w","w","w","x",2,null,null,"k","w","w","w","x","w","x","w","w","w",3]
[null,null,"w","w","w","w","w","w","w","w","w","w",0,null,null,"w","w","w","w","w","w",4,"w","w","w",1,null,null,"x","x","w","w",3,"w","w","w","k","w",4,null,null,"w","w","w","w","w","w",3,"w","w",4,2,null,null,"w","w","q","w","w","x","w","w","w","w",2,null,null,"w","w","w","w","w","w","w","w","w","w",0,null,null,"w","w","w","w","w","w","w","w","w","w",0,null,null,"w","w","w","w","x","w","w","w","w",2,2]
[null,null,2,2,"w","w","w","w","w","w","w","w",2,null,null,"w","w","w","w","w","w",4,"w","w","w",1,null,null,"w","w","w","w",3,"w","u","w","w","w",2,null,null,"x","w","x","l","w","w",3,"w","w",4,5,null,null,"w","w","x","w","w","w","w","w","w","w",1,null,null,"x","q","x","w","w","w","w","w","w","w",3,null,null,"w","w","x","w","x","x","x","x","w","x",6,null,null,"w","w","w","w","x","w","w","w","w","x",2]
[null,null,"w","w","w","w","x","x","w","u","w","x",4,null,null,3,3,3,"w","w","w",4,"w","w","w",4,null,null,"w","w","w","w",3,"w","o","w","w","x",3,null,null,"w","w","w","w","w","w","w","w","w",4,1,null,null,"x","w","w","w","w","x","w","w","w","w",2,null,null,"w","w","w","w","w","w","w","w","w","x",1,null,null,"w","w","o","w","w","w","w","w","w","w",1,null,null,"w","w","w","w","w","w","w","w","w","w",0]
[null,null,"w","w","w","w","w","w","w","o","w","w",1,null,null,"w","w","w","w","w","w","w","w","w","w",0,null,null,"w","w","w","w","w","w","w","w","w","w",0,null,null,"r","l","w","w","w","w","w","w","w","w",2,null,null,"w","w","w","w","w",2,"w","w","w","w",1,null,null,"x","w","w","w","w","w","x","w","w","x",3,null,null,"w","w","w","w","x","w","x","x","w","x",4,null,null,"w","w","w","w","w","w","w","r","l","w",2]
[null,null,"w","w","w","w","w","x","w","w","w","w",1,null,null,"x","w","w","w","w","w","w","w","w","w",1,null,null,"w","w","w","w","x","w","w","w","w","x",2,null,null,"w","w","w","w","w","x","w","w","w","w",1,null,null,"w","w","w","x","w","w","w","w","w","w",1,null,null,"x","w","k","w","w","w","w","w","w","w",2,null,null,"w","w","x","w","w","w","w","w","w","w",1,null,null,"w","w","x","x","x","w","w","w","w","w",3]
[null,{"$f":"SUM(C349:L349)","v":20},1,5,0,0,3,5,2,2,0,2,{"$f":"SUM(M339:M348)","v":20},null,{"$f":"SUM(P349:Y349)","v":20},4,1,1,1,4,0,6,1,0,2,{"$f":"SUM(Z339:Z348)","v":20},null,{"$f":"SUM(AC349:AL349)","v":20},1,4,0,2,4,4,2,0,1,2,{"$f":"SUM(AM339:AM348)","v":20},null,{"$f":"SUM(AP349:AY349)","v":20},2,1,4,2,2,2,3,0,0,4,{"$f":"SUM(AZ339:AZ348)","v":20},null,{"$f":"SUM(BC349:BL349)","v":20},1,1,3,4,0,4,2,1,3,1,{"$f":"SUM(BM339:BM348)","v":20},null,{"$f":"SUM(BP349:BY349)","v":20},5,1,3,0,4,0,2,1,1,3,{"$f":"SUM(BZ339:BZ348)","v":20},null,{"$f":"SUM(CC349:CL349)","v":20},0,0,5,0,2,2,3,3,0,5,{"$f":"SUM(CM339:CM348)","v":20},null,{"$f":"SUM(CP349:CY349)","v":20},2,0,2,1,6,0,2,2,2,3,{"$f":"SUM(CZ339:CZ348)","v":20}]
[]
[null,null,"Tagi, 13.09.21",null,null,null,null,null,null,null,null,null,null,null,null,"Tagi, 14.09.21",null,null,null,null,null,null,null,null,null,null,null,null,"Tagi, 15.09.21",null,null,null,null,null,null,null,null,null,null,null,null,"Tagi, 16.09.21",null,null,null,null,null,null,null,null,null,null,null,null,"Tagi, 17.09.21",null,null,null,null,null,null,null,null,null,null,null,null,"Tagi, 18.09.21",null,null,null,null,null,null,null,null,null,null,null,null,"Tagi, 20.09.21",null,null,null,null,null,null,null,null,null,null,null,null,"Tagi, 21.09.21"]
[null,113,null,null,null,null,null,null,null,null,null,null,1,null,114,null,null,"k",null,null,null,null,null,null,null,2,null,115,null,null,"q",null,null,null,null,null,null,null,4,null,116,null,null,null,null,null,null,null,null,null,null,3,null,117,null,null,null,"u",null,null,null,null,null,null,1,null,118,null,null,null,null,null,null,null,null,null,null,1,null,119,null,null,null,null,null,null,null,null,null,null,1,null,120,null,null,null,null,null,null,null,null,null,null,2]
[null,"Tagi, 13.09.21",null,null,"k",null,null,null,null,null,null,null,5,null,"Tagi, 14.09.21",null,null,null,null,null,null,null,null,null,null,0,null,"Tagi, 15.09.21",null,null,null,null,null,null,null,null,null,null,0,null,"Tagi, 16.09.21",null,null,null,null,null,null,null,null,null,null,0,null,"Tagi, 17.09.21",null,null,null,null,null,null,null,null,null,null,2,null,"Tagi, 18.09.21",null,null,null,null,null,null,null,null,null,null,0,null,"Tagi, 20.09.21",null,null,null,null,null,null,null,null,null,null,0,null,"Tagi, 21.09.21",null,null,null,null,null,null,null,null,null,null,1]
[null,null,null,null,null,null,null,null,null,null,null,null,0,null,null,null,null,null,null,null,null,null,null,"l",null,3,null,null,null,null,null,null,null,null,null,null,null,null,4,null,null,null,null,null,null,null,"k",null,null,null,null,4,null,null,null,null,null,null,null,null,null,null,null,null,3,null,null,null,null,null,null,null,null,null,null,null,null,3,null,null,null,null,null,null,null,null,null,null,null,null,5,null,null,null,null,"l",null,null,null,null,null,null,null,2]
[null,null,null,null,null,null,null,null,null,null,null,null,1,null,null,null,null,null,null,null,null,null,null,null,null,2,null,null,null,null,null,null,null,null,null,null,null,null,0,null,null,null,null,null,null,null,null,null,null,null,null,3,null,null,null,null,null,null,null,null,null,null,null,null,3,null,null,null,null,null,null,null,null,null,null,null,null,2,null,null,null,null,null,null,null,null,null,null,null,null,1,null,null,null,null,null,null,null,null,"r",null,null,null,3]
[null,null,null,null,null,null,null,null,null,null,null,null,3,null,null,null,null,null,null,null,null,null,null,null,null,3,null,null,null,null,null,null,null,null,"w",null,null,null,3,null,null,null,null,null,null,null,null,null,null,null,null,1,null,null,null,null,null,null,null,null,null,null,null,null,1,null,null,null,null,null,null,null,null,null,null,null,null,3,null,null,null,null,null,null,"r",null,null,null,null,null,2,null,null,null,null,null,null,null,null,null,null,null,null,1]
[null,null,null,null,null,null,null,null,null,null,null,null,2,null,null,null,null,null,null,null,null,null,null,null,null,0,null,null,null,null,null,null,null,null,null,null,null,null,0,null,null,null,null,null,"k",null,null,null,null,null,null,2,null,null,null,null,null,null,null,"l",null,null,null,null,5,null,null,null,null,null,null,null,"o",null,null,null,null,3,null,null,null,null,null,null,null,null,null,null,null,null,2,null,null,null,null,null,null,null,null,null,null,null,null,1]
[null,null,null,null,null,null,null,null,null,null,null,null,0,null,null,null,null,null,null,null,null,null,null,null,null,3,null,null,null,null,null,null,null,null,null,null,null,null,0,null,null,null,null,null,null,null,null,null,null,"q",null,1,null,null,null,null,null,null,null,null,null,null,null,null,0,null,null,"k",null,null,null,null,null,null,null,null,null,3,null,null,null,null,null,null,null,null,null,null,null,null,3,null,null,null,null,null,null,null,null,null,null,null,null,4]
[null,null,null,null,null,"u",null,null,null,null,null,null,1,null,null,null,null,null,null,null,null,"l",null,null,null,4,null,null,null,"l",null,null,null,null,null,null,null,null,2,null,null,null,null,null,null,null,null,null,null,null,null,1,null,null,null,null,null,null,null,null,null,null,null,null,2,null,null,null,null,null,null,null,null,null,null,null,null,0,null,null,null,null,null,"o",null,"u",null,null,null,null,4,null,null,null,null,null,null,null,null,null,null,null,null,2]
[null,null,null,null,null,null,null,null,null,null,"q",null,4,null,null,null,null,null,null,null,null,null,null,null,null,2,null,null,null,null,null,null,null,null,null,null,"w",null,5,null,null,null,null,null,null,null,null,null,null,null,null,4,null,null,null,null,null,null,null,null,null,null,null,null,1,null,null,null,null,null,"l",null,null,null,null,null,null,4,null,null,null,null,null,null,null,null,null,null,null,null,1,null,null,null,null,null,null,null,null,null,null,null,null,0]
[null,null,null,null,null,null,null,null,null,null,null,null,3,null,null,null,null,null,null,null,null,null,null,null,null,1,null,null,null,null,null,null,null,null,null,null,null,null,2,null,null,null,null,null,null,null,null,null,null,null,null,1,null,null,null,null,null,null,null,null,null,null,null,null,2,null,null,null,null,null,null,null,null,null,null,null,null,1,null,null,null,null,"w",null,null,null,null,null,null,null,1,null,null,"k",null,null,null,null,null,null,"l",null,null,4]
[null,{"$f":"SUM(C362:L362)","v":20},2,3,1,2,1,3,2,3,1,2,{"$f":"SUM(M352:M361)","v":20},null,{"$f":"SUM(P362:Y362)","v":20},4,0,3,1,0,5,1,1,2,3,{"$f":"SUM(Z352:Z361)","v":20},null,{"$f":"SUM(AC362:AL362)","v":20},2,5,1,1,1,2,3,3,1,1,{"$f":"SUM(AM352:AM361)","v":20},null,{"$f":"SUM(AP362:AY362)","v":20},3,1,1,2,2,2,0,4,3,2,{"$f":"SUM(AZ352:AZ361)","v":20},null,{"$f":"SUM(BC362:BL362)","v":20},2,1,1,2,5,1,2,0,2,4,{"$f":"SUM(BM352:BM361)","v":20},null,{"$f":"SUM(BP362:BY362)","v":20},3,1,1,4,1,2,2,0,4,2,{"$f":"SUM(BZ352:BZ361)","v":20},null,{"$f":"SUM(CC362:CL362)","v":20},4,0,1,2,3,3,1,4,1,1,{"$f":"SUM(CM352:CM361)","v":20},null,{"$f":"SUM(CP362:CY362)","v":20},1,2,1,2,2,2,2,2,2,4,{"$f":"SUM(CZ352:CZ361)","v":20}]
[null,null,"Lösung",null,null,null,null,null,null,null,null,null,null,null,null,"Lösung",null,null,null,null,null,null,null,null,null,null,null,null,"Lösung",null,null,null,null,null,null,null,null,null,null,null,null,"Lösung",null,null,null,null,null,null,null,null,null,null,null,null,"Lösung",null,null,null,null,null,null,null,null,null,null,null,null,"Lösung",null,null,null,null,null,null,null,null,null,null,null,null,"Lösung",null,null,null,null,null,null,null,null,null,null,null,null,"Lösung"]
[null,113,"w","w","w","w","w","w","w","w","w","x",1,null,114,"w","w","k","w","w","x","w","w","w","w",2,null,115,"w","x","q","x","w","w","x","w","w","w",4,null,116,"w","w","w","w",2,2,"w","x","w","w",3,null,117,"w","w","w","u","w","w","w","w","w","w",1,null,118,"w","w","w","w","w","w","x","w","w","w",1,null,119,"w","w","w","w","x","w","w","w","w","w",1,null,120,"w","w","w","x","w","w","w","w","x","w",2]
[null,"Tagi, 13.09.21","w","w","k","w",4,4,4,4,"w","w",5,null,"Tagi, 14.09.21","w","w","w","w","w","w","w","w","w","w",0,null,"Tagi, 15.09.21","w","w","w","w","w","w","w","w","w","w",0,null,"Tagi, 16.09.21","w","w","w","w","w","w","w","w","w","w",0,null,"Tagi, 17.09.21","w","w","w","o","w","w","w","w","w","x",2,null,"Tagi, 18.09.21","w","w","w","w","w","w","w","w","w","w",0,null,"Tagi, 20.09.21","w","w","w","w","w","w","w","w","w","w",0,null,"Tagi, 21.09.21","w","w","w","w","w","w","w","w","x","w",1]
[null,null,"w","w","w","w","w","w","w","w","w","w",0,null,null,"w","w","w","w","w","x","w","x","l","w",3,null,null,"w","x","w","w","w","x",3,3,"w","w",4,null,null,3,"w","w","w","w","k","w","x","w","x",4,null,null,"x","w","w","w","w","w","x","w","w",4,3,null,null,"x","w","w","w","x","w","x","w","w","w",3,null,null,"w","w","w","w","x","w",4,4,4,4,5,null,null,"w","r","l","w","w","w","w","w","w","w",2]
[null,null,"w","x","w","w","w","w","w","w","w","w",1,null,null,"w","w",2,"w","w","x","w","w","w","w",2,null,null,"w","w","w","w","w","w","w","w","w","w",0,null,null,3,"w","w","w","w","w","w","x","w","x",3,null,null,"w","w","w","w","x","w","x","w","w",4,3,null,null,"x","w","w","w","w","w","w","w","x","w",2,null,null,"w","w","x","w","w","w","w","w","w","w",1,null,null,"w","w","w","w","x","w","r","x","w","w",3]
[null,null,"w","w","w","w","w",3,3,3,"w","w",3,null,null,"w","w",2,"w","w","x","w","w","x","w",3,null,null,"w","x","w","w","w","w","w",2,2,"w",3,null,null,3,"w","w","w","w","w","w","w","w","w",1,null,null,"w","w","w","w","w","w","w","w","w",4,1,null,null,"w","w","w",3,"w","u","w","w","x","w",3,null,null,"w","w","w","w","r","l","w","w","w","w",2,null,null,"w","w","w","w","w","w","w","w","w",4,1]
[null,null,2,2,"w","w","w","w","w","w","w","w",2,null,null,"w","w","w","w","w","w","w","w","w","w",0,null,null,"w","w","w","w","w","w","w","w","w","w",0,null,null,"w","w","w","k","w","w","w","w","x","w",2,null,null,3,3,3,"w","x","l","w","w","w","w",5,null,null,"w","w","w","x","w","o","w","w","x","w",3,null,null,"x","w","w","w","w","w","w","x","w","w",2,null,null,"w","w","w","w","w","w","w","w","w",4,1]
[null,null,"w","w","w","w","w","w","w","w","w","w",0,null,null,4,"w","w","x","w","w","w","w","w",3,3,null,null,"w","w","w","w","w","w","w","w","w","w",0,null,null,"w","w","w","w","w","w","w","w","q","w",1,null,null,"w","w","w","w","w","w","w","w","w","w",0,null,null,"k","w","w","x","w","w","w","w","x","w",3,null,null,"x","w","w","u","w","w","w","x","w","w",3,null,null,"w","w","w",3,3,3,"w","w","w",4,4]
[null,null,"w","w","w","u","w","w","w","w","w","w",1,null,null,4,"w","w","w","w","x","l","w","w",3,4,null,null,"r","l","w","w","w","w","w","w","w","w",2,null,null,"w","w","w","w","w","w","w","w","x","w",1,null,null,"w","w","w","w","x","w","w","w","x","w",2,null,null,"w","w","w","w","w","w","w","w","w","w",0,null,null,"x","w","w","o","w","u","w","x","w","w",4,null,null,"w","x","w","w","w","w","w","w","w","x",2]
[null,null,"w","w","w","o","w","w","w","x","q","x",4,null,null,4,"w","w","w","w","w","w","w","w",3,2,null,null,"w","w","w","w","x","x","x","x","w","x",5,null,null,"w","x",4,4,4,"w","w","w","w","w",4,null,null,"w","w","w","w","x","w","w","w","w","w",1,null,null,"w",3,3,"l","w","w","w","w","w",2,4,null,null,"w","w","w","w","w","x","w","w","w","w",1,null,null,"w","w","w","w","w","w","w","w","w","w",0]
[null,null,"x","x","w","w","w","x","w","w","w","w",3,null,null,4,"w","w","w","w","w","w","w","w","w",1,null,null,"x","x","w","w","w","w","w","w","w","w",2,null,null,"w","w","w","w","w","w","w","x","w","w",1,null,null,"w","w","w","w","x","w","w","w","x","w",2,null,null,"w","w","w","w","w","w","w","w","w",2,1,null,null,"x","w","w","w","w","w","w","w","w","w",1,null,null,"k","w","w","w","w",3,"x","l","w","w",4]
[null,{"$f":"SUM(C374:L374)","v":20},2,3,1,2,1,3,2,3,1,2,{"$f":"SUM(M364:M373)","v":20},null,{"$f":"SUM(P374:Y374)","v":20},4,0,3,1,0,5,1,1,2,3,{"$f":"SUM(Z364:Z373)","v":20},null,{"$f":"SUM(AC374:AL374)","v":20},2,5,1,1,1,2,3,3,1,1,{"$f":"SUM(AM364:AM373)","v":20},null,{"$f":"SUM(AP374:AY374)","v":20},3,1,1,2,2,2,0,4,3,2,{"$f":"SUM(AZ364:AZ373)","v":20},null,{"$f":"SUM(BC374:BL374)","v":20},2,1,1,2,5,1,2,0,2,4,{"$f":"SUM(BM364:BM373)","v":20},null,{"$f":"SUM(BP374:BY374)","v":20},3,1,1,4,1,2,2,0,4,2,{"$f":"SUM(BZ364:BZ373)","v":20},null,{"$f":"SUM(CC374:CL374)","v":20},4,0,1,2,3,3,1,4,1,1,{"$f":"SUM(CM364:CM373)","v":20},null,{"$f":"SUM(CP374:CY374)","v":20},1,2,1,2,2,2,2,2,2,4,{"$f":"SUM(CZ364:CZ373)","v":20}]
[]
[null,null,"Tagi, 22.09.21",null,null,null,null,null,null,null,null,null,null,null,null,"Tagi, 23.09.21",null,null,null,null,null,null,null,null,null,null,null,null,"Tagi, 24.09.21",null,null,null,null,null,null,null,null,null,null,null,null,"Tagi, 25.09.21",null,null,null,null,null,null,null,null,null,null,null,null,"Tagi, 27.09.21",null,null,null,null,null,null,null,null,null,null,null,null,"Beobachter, 24.09.21",null,null,null,null,null,null,null,null,null,null,null,null,"Tagi, 28.09.21",null,null,null,null,null,null,null,null,null,null,null,null,"Tagi, 29.09.21"]
[null,121,null,null,null,null,null,null,null,"q",null,null,3,null,122,null,null,null,null,null,null,null,null,null,null,3,null,123,null,null,null,null,null,null,null,null,null,null,1,null,124,null,null,null,null,null,null,null,null,null,null,1,null,125,null,null,null,null,null,null,null,null,null,null,1,null,126,null,null,null,null,null,null,null,null,null,null,0,null,127,null,null,null,null,null,null,null,"l",null,null,4,null,128,null,null,null,null,null,null,null,null,null,"w",4]
[null,"Tagi, 22.09.21",null,null,null,null,null,null,null,null,null,null,0,null,"Tagi, 23.09.21",null,null,null,null,null,null,null,null,null,null,1,null,"Tagi, 24.09.21",null,null,null,null,null,null,null,null,null,null,5,null,"Tagi, 25.09.21",null,null,null,null,null,null,null,null,null,null,3,null,"Tagi, 27.09.21",null,null,null,null,null,"r",null,null,null,null,2,null,"Beobachter, 24.09.21",null,null,null,null,null,null,null,null,null,null,0,null,"Tagi, 28.09.21",null,null,null,null,null,null,null,null,null,null,0,null,"Tagi, 29.09.21",null,null,null,null,null,null,null,"q",null,null,3]
[null,null,null,null,"u",null,null,null,null,null,null,null,1,null,null,null,null,null,null,null,null,"q",null,null,null,5,null,null,null,null,null,null,null,null,null,null,null,null,2,null,null,null,null,null,null,null,null,null,null,null,null,2,null,null,null,null,null,null,null,null,null,null,null,null,1,null,null,null,null,null,null,null,null,null,null,null,null,5,null,null,null,null,null,null,null,null,null,null,null,null,2,null,null,null,null,null,null,null,null,null,null,null,null,3]
[null,null,null,null,null,null,null,null,null,null,null,null,2,null,null,null,null,null,null,null,null,null,null,null,null,1,null,null,null,null,null,null,null,null,null,null,null,null,1,null,null,null,null,null,null,null,null,null,null,null,null,2,null,null,null,null,null,null,null,null,null,null,null,null,2,null,null,null,null,null,null,null,null,null,null,null,null,2,null,null,null,null,null,null,null,null,null,null,null,null,0,null,null,null,null,null,null,null,null,null,null,null,null,1]
[null,null,null,null,null,null,null,null,null,null,null,null,2,null,null,null,null,null,null,null,null,null,null,null,null,0,null,null,"u",null,null,null,null,"k",null,null,null,null,3,null,null,null,null,null,null,null,null,null,null,null,null,0,null,null,null,null,"u",null,null,null,null,null,null,null,4,null,null,null,null,null,null,null,null,null,null,null,null,1,null,null,null,null,null,null,null,null,null,null,null,null,4,null,null,null,null,null,null,null,null,null,null,null,null,0]
[null,null,null,null,null,null,null,null,null,null,null,null,5,null,null,"w",null,null,null,null,null,null,null,null,null,2,null,null,null,null,null,null,null,null,null,null,null,null,2,null,null,"k",null,null,null,null,null,null,null,null,null,3,null,null,null,null,null,null,null,null,null,null,null,null,1,null,null,null,null,null,null,null,null,null,null,null,null,4,null,null,null,null,null,null,null,null,null,null,"w",null,4,null,null,null,null,null,null,null,null,null,null,null,null,6]
[null,null,null,null,null,null,null,null,null,null,null,null,0,null,null,null,null,"w",null,null,null,null,null,null,null,3,null,null,null,null,null,"r",null,null,null,null,null,null,2,null,null,null,null,null,null,null,null,null,null,null,null,2,null,null,null,null,null,null,null,null,null,null,null,null,0,null,null,null,null,null,null,null,null,null,null,null,null,1,null,null,null,null,null,null,null,null,null,null,null,null,2,null,null,null,null,null,null,null,null,null,null,null,null,0]
[null,null,null,null,null,null,null,null,"l",null,null,null,3,null,null,null,null,null,null,null,null,null,null,null,null,1,null,null,null,null,null,null,null,null,null,null,null,null,1,null,null,null,null,null,null,null,"r",null,null,null,null,3,null,null,null,null,null,null,null,"w",null,null,null,null,4,null,null,null,null,null,null,"q",null,null,null,null,null,5,null,null,null,null,null,null,null,null,null,null,null,null,1,null,null,null,null,null,null,null,null,null,null,null,null,0]
[null,null,null,null,null,null,null,null,null,null,"k",null,2,null,null,null,null,null,null,null,null,null,"u",null,null,2,null,null,null,null,null,null,null,null,null,null,null,null,0,null,null,null,null,"r",null,null,null,null,null,null,null,2,null,null,null,null,null,null,null,null,null,null,null,null,0,null,null,null,null,null,null,null,null,null,null,"o",null,1,null,null,null,null,null,null,null,null,null,null,null,null,1,null,null,null,null,null,null,"w",null,null,null,null,null,1]
[null,null,null,null,null,null,null,null,null,null,null,null,2,null,null,null,null,null,null,null,null,null,null,null,null,2,null,null,null,null,null,null,null,null,null,null,null,null,3,null,null,null,null,null,null,null,null,null,null,null,null,2,null,null,null,null,null,null,null,null,null,null,"w",null,5,null,null,null,null,null,null,null,null,null,null,null,null,1,null,null,null,null,null,"k",null,null,null,null,null,null,2,null,null,"r",null,null,null,null,null,null,null,null,null,2]
[null,{"$f":"SUM(C387:L387)","v":20},1,3,2,0,2,1,4,2,3,2,{"$f":"SUM(M377:M386)","v":20},null,{"$f":"SUM(P387:Y387)","v":20},4,0,3,2,2,0,3,4,0,2,{"$f":"SUM(Z377:Z386)","v":20},null,{"$f":"SUM(AC387:AL387)","v":20},3,3,2,4,2,1,3,1,0,1,{"$f":"SUM(AM377:AM386)","v":20},null,{"$f":"SUM(AP387:AY387)","v":20},1,3,1,2,4,1,2,0,4,2,{"$f":"SUM(AZ377:AZ386)","v":20},null,{"$f":"SUM(BC387:BL387)","v":20},2,0,5,2,2,3,1,1,2,2,{"$f":"SUM(BM377:BM386)","v":20},null,{"$f":"SUM(BP387:BY387)","v":20},0,0,3,1,4,2,4,1,3,2,{"$f":"SUM(BZ377:BZ386)","v":20},null,{"$f":"SUM(CC387:CL387)","v":20},2,0,2,5,0,4,2,1,2,2,{"$f":"SUM(CM377:CM386)","v":20},null,{"$f":"SUM(CP387:CY387)","v":20},2,4,1,2,3,1,0,3,0,4,{"$f":"SUM(CZ377:CZ386)","v":20}]
[null,null,"Lösung",null,null,null,null,null,null,null,null,null,null,null,null,"Lösung",null,null,null,null,null,null,null,null,null,null,null,null,"Lösung",null,null,null,null,null,null,null,null,null,null,null,null,"Lösung",null,null,null,null,null,null,null,null,null,null,null,null,"Lösung",null,null,null,null,null,null,null,null,null,null,null,null,"Lösung",null,null,null,null,null,null,null,null,null,null,null,null,"Lösung",null,null,null,null,null,null,null,null,null,null,null,null,"Lösung"]
[null,121,"w","w","w","w","w","w","x","q","x","w",3,null,122,"w","w","x","x","w","w","w","w","w","x",3,null,123,"w","w","w","w","w","w",3,"w","w","w",1,null,124,"w","w","w","w","x","w","w","w","w","w",1,null,125,"w","w","x","w","w","w","w","w","w","w",1,null,126,"w","w","w","w","w","w","w","w","w","w",0,null,127,"w","w","x","w","w",3,3,3,"w","w",4,null,128,"w","x","w","x","x","w","w","x","w","w",4]
[null,"Tagi, 22.09.21","w","w","w","w","w","w","w","w","w","w",0,null,"Tagi, 23.09.21","w","w","w","w","w","w","x","w","w","w",1,null,"Tagi, 24.09.21","w",4,4,4,"x","w",3,"w","w","w",5,null,"Tagi, 25.09.21","w","x","w","w","x","w","w","w","w","x",3,null,"Tagi, 27.09.21","w","w","w","w","w","r","l","w","w","w",2,null,"Beobachter, 24.09.21","w","w","w","w","w","w","w","w","w","w",0,null,"Tagi, 28.09.21","w","w","w","w","w","w","w","w","w","w",0,null,"Tagi, 29.09.21","w",3,"w","w","w","w","w","q","w","x",3]
[null,null,"w","w","u","w","w","w","w","w","w","w",1,null,null,"w","w","x","x","x","w","q","w","w","x",5,null,null,"w","w","w","w","w","w",3,"w","w","x",2,null,null,"w","x","w","w","x","w","w","w","w","w",2,null,null,2,"w","w","w","w","w","w","w","w","w",1,null,null,"w","w","x","w","x","w","x","x","w","x",5,null,null,"w","w","x","w","w","w","x","w","w","w",2,null,null,"w",3,"w","w","w","w","w","x","w",2,3]
[null,null,"w","w","o","w","w","w","w","w","w","x",2,null,null,"w","w","w","w","w","w","x","w","w","w",1,null,null,"w","w","w","x","w","w","w","w","w","w",1,null,null,"w","x","w","w","x","w","w","w","w","w",2,null,null,2,"w","w","w","w","x","w","w","w","w",2,null,null,"w","w","x","w","x","w","w","w","w","w",2,null,null,"w","w","w","w","w","w","w","w","w","w",0,null,null,"w","w","w","w","x","w","w","w","w","w",1]
[null,null,"x","w","w","w","x","w","w","w","w","w",2,null,null,"w","w","w","w","w","w","w","w","w","w",0,null,null,"u","w","w","x","w","k","w","w","w","w",3,null,null,"w","w","w","w","w","w","w","w","w","w",0,null,null,"w","w","u","w","w","w","w","x","x","x",4,null,null,"w","w","w","w","w","w","w","w","w","x",1,null,null,"x","w","w","x","w",3,"w","w","w","x",4,null,null,"w","w","w","w","w","w","w","w","w","w",0]
[null,null,"w","w","w","w","x","w",4,4,4,4,5,null,null,"w","w","x","w","w","w","w","x","w","w",2,null,null,"x","w","w","w","w","w","w","x","w","w",2,null,null,"k","w","w","w","w","w","x","w",3,"w",3,null,null,"w","w","x","w","w","w","w","w","w","w",1,null,null,"w","w","x","w","x","x","x","w","w","w",4,null,null,"x","w","w","x","w",3,"w","w","w","x",4,null,null,"x","w","x","x","x","x","w","w","w","x",6]
[null,null,"w","w","w","w","w","w","w","w","w","w",0,null,null,4,"w","w","w","x","w","w","x","w","w",3,null,null,"w","w","w","r","l","w","w","w","w","w",2,null,null,"w","w","w","x","w","w","w","w",3,"w",2,null,null,"w","w","w","w","w","w","w","w","w","w",0,null,null,"w","w","w","w","w","w","w","w","x","w",1,null,null,"w","w","w","x","w",3,"w","w","w","w",2,null,null,"w","w","w","w","w","w","w","w","w","w",0]
[null,null,"w","x","w","w","w","x","l","w","w","w",3,null,null,4,"w","w","w","w","w","w","w","w","w",1,null,null,"w","x","w","w","w","w","w","w","w","w",1,null,null,"w","w","w","w","w","r","x","w",3,"w",3,null,null,"w","w",3,3,3,"w","w","w","x","w",4,null,null,"w","w","w","x","q","x","x","w","x","w",5,null,null,"w","w","w","x","w","w","w","w","w","w",1,null,null,"w","w","w","w","w","w","w","w","w","w",0]
[null,null,"w","x","w","w","w","w","w","w","k","w",2,null,null,4,"w","w","w","w","w","w","u","w","w",2,null,null,"w","w","w","w","w","w","w","w","w","w",0,null,null,"w","w","r","l","w","w","w","w","w","w",2,null,null,"w","w","w","w","w","w","w","w","w","w",0,null,null,"w","w","w","w","w","w","w","w","o","w",1,null,null,"w","w","w","w","w","w","w","w",2,"w",1,null,null,"w","w","w","w","w","w","w","w","w","x",1]
[null,null,"w","x","w","w","w","w","x","w","w","w",2,null,null,4,"w","w","w","w","w","w","x","w","w",2,null,null,3,3,3,"w","w","w","w","w","w","w",3,null,null,"w","w","w","w","w","w","w","w","x","x",2,null,null,"w","w",4,4,4,4,"w","w","w","x",5,null,null,"w","w","w","w","w","w","x","w","w","w",1,null,null,"w","w","w","k","w","w","w","w",2,"w",2,null,null,"r","l","w","w","w","w","w","w","w","w",2]
[null,{"$f":"SUM(C399:L399)","v":20},1,3,2,0,2,1,4,2,3,2,{"$f":"SUM(M389:M398)","v":20},null,{"$f":"SUM(P399:Y399)","v":20},4,0,3,2,2,0,3,4,0,2,{"$f":"SUM(Z389:Z398)","v":20},null,{"$f":"SUM(AC399:AL399)","v":20},3,3,2,4,2,1,3,1,0,1,{"$f":"SUM(AM389:AM398)","v":20},null,{"$f":"SUM(AP399:AY399)","v":20},1,3,1,2,4,1,2,0,4,2,{"$f":"SUM(AZ389:AZ398)","v":20},null,{"$f":"SUM(BC399:BL399)","v":20},2,0,5,2,2,3,1,1,2,2,{"$f":"SUM(BM389:BM398)","v":20},null,{"$f":"SUM(BP399:BY399)","v":20},0,0,3,1,4,2,4,1,3,2,{"$f":"SUM(BZ389:BZ398)","v":20},null,{"$f":"SUM(CC399:CL399)","v":20},2,0,2,5,0,4,2,1,2,2,{"$f":"SUM(CM389:CM398)","v":20},null,{"$f":"SUM(CP399:CY399)","v":20},2,4,1,2,3,1,0,3,0,4,{"$f":"SUM(CZ389:CZ398)","v":20}]
[]
[null,null,"Tagi, 30.09.21",null,null,null,null,null,null,null,null,null,null,null,null,"Tagi, 01.10.21",null,null,null,null,null,null,null,null,null,null,null,null,"Tagi, 02.10.21",null,null,null,null,null,null,null,null,null,null,null,null,"Tagi, 04.10.21",null,null,null,null,null,null,null,null,null,null,null,null,"Tagi, 05.10.21",null,null,null,null,null,null,null,null,null,null,null,null,"Tagi, 06.10.21",null,null,null,null,null,null,null,null,null,null,null,null,"Tagi, 07.10.21",null,null,null,null,null,null,null,null,null,null,null,null,"07.10.21(zweite)"]
[null,129,"k",null,null,null,null,"l",null,null,null,null,5,null,130,null,null,"k",null,null,null,null,null,null,null,3,null,131,null,null,null,null,null,null,null,"k",null,null,2,null,132,null,null,null,null,null,null,null,null,null,null,3,null,133,null,null,null,null,null,null,null,null,null,null,3,null,134,null,null,null,null,null,null,null,null,null,null,1,null,135,null,null,null,null,null,null,null,"k",null,null,4,null,136,null,null,null,null,null,null,null,"k",null,null,4]
[null,"Tagi, 30.09.21",null,null,null,null,null,null,null,null,null,null,0,null,"Tagi, 01.10.21",null,null,null,null,null,null,null,null,null,null,1,null,"Tagi, 02.10.21",null,null,null,null,null,null,null,null,null,null,2,null,"Tagi, 04.10.21",null,null,null,null,null,null,null,null,"l",null,2,null,"Tagi, 05.10.21",null,null,null,null,null,null,null,null,null,null,0,null,"Tagi, 06.10.21",null,null,null,null,"q",null,null,null,null,null,4,null,"Tagi, 07.10.21",null,null,null,null,null,null,null,null,null,null,0,null,"07.10.21(zweite)",null,null,null,null,null,null,null,null,null,null,0]
[null,null,null,null,null,null,null,null,null,null,null,null,2,null,null,null,null,null,null,null,"w",null,"w",null,null,4,null,null,null,null,null,null,null,null,null,null,null,null,0,null,null,null,null,null,null,null,null,null,null,null,null,0,null,null,null,null,null,null,null,null,null,null,null,null,1,null,null,null,null,null,null,null,null,null,null,null,null,2,null,null,null,null,null,null,null,null,null,null,null,null,3,null,null,null,null,null,null,null,null,null,null,null,null,3]
[null,null,null,null,null,null,null,null,null,null,null,null,3,null,null,null,null,null,null,null,null,null,null,null,null,0,null,null,"k",null,null,null,null,null,null,null,null,null,3,null,null,null,null,null,null,null,null,null,null,null,null,3,null,null,null,null,null,null,null,null,null,null,null,null,1,null,null,null,null,null,null,null,null,null,null,null,null,2,null,null,null,null,null,null,null,null,null,null,null,null,2,null,null,null,null,null,null,null,null,null,null,null,null,2]
[null,null,"k",null,null,null,null,null,null,null,null,null,3,null,null,null,null,null,null,null,null,null,null,null,null,0,null,null,null,null,null,null,null,null,null,null,null,null,2,null,null,null,"o",null,null,null,null,null,null,null,null,1,null,null,null,null,null,null,null,null,null,null,null,null,5,null,null,null,null,null,null,null,null,null,null,null,null,1,null,null,null,null,null,null,null,null,null,null,null,null,1,null,null,null,null,null,null,null,null,null,null,null,null,1]
[null,null,null,null,null,null,null,null,null,null,null,null,1,null,null,null,null,null,null,null,null,null,null,null,null,7,null,null,null,null,null,null,null,null,null,null,null,null,2,null,null,null,null,null,null,null,null,null,null,null,null,1,null,null,null,null,null,null,null,null,null,null,null,null,1,null,null,null,null,null,null,null,null,null,null,null,null,0,null,null,null,null,"w",null,null,null,null,null,null,null,4,null,null,null,null,"w",null,null,null,null,null,null,null,4]
[null,null,null,null,null,null,null,null,null,null,null,null,0,null,null,null,null,null,null,null,null,null,null,null,null,0,null,null,null,null,null,null,null,null,null,null,null,null,1,null,null,null,null,null,null,null,null,null,null,null,null,3,null,null,null,"u",null,null,null,null,null,null,null,null,2,null,null,null,null,null,"u",null,null,null,null,null,null,1,null,null,null,null,null,null,null,null,null,null,null,null,0,null,null,null,null,null,null,null,null,null,null,null,null,0]
[null,null,null,null,null,null,null,null,null,null,null,null,1,null,null,null,null,null,null,null,null,null,null,null,null,0,null,null,null,"l",null,null,null,null,null,null,null,null,4,null,null,null,null,null,null,null,null,null,null,null,null,2,null,null,null,null,null,null,null,null,null,"o",null,null,3,null,null,null,null,null,null,null,null,null,null,null,null,3,null,null,null,null,null,null,null,null,null,null,null,null,4,null,null,null,null,null,null,null,null,null,null,null,null,4]
[null,null,null,null,null,null,null,null,"q",null,null,null,3,null,null,null,null,null,null,null,null,null,"l",null,null,4,null,null,null,null,null,null,null,null,null,null,null,null,0,null,null,"r",null,null,null,null,null,null,null,null,null,4,null,null,null,null,null,null,null,null,null,null,null,null,1,null,null,null,null,null,null,null,null,null,null,null,null,2,null,null,null,null,null,null,"o",null,null,null,null,null,1,null,null,null,null,null,null,"o",null,null,null,null,null,1]
[null,null,null,null,null,null,null,null,null,null,null,null,2,null,null,null,null,null,null,null,null,null,null,null,null,1,null,null,null,null,null,null,null,"q",null,null,null,null,4,null,null,null,null,null,null,null,"o",null,null,null,null,1,null,null,null,null,null,null,null,null,null,null,null,null,3,null,null,null,null,null,null,null,null,null,null,"o",null,4,null,null,null,null,null,null,null,null,null,null,null,null,1,null,null,null,null,null,null,null,null,null,null,null,null,1]
[null,{"$f":"SUM(C412:L412)","v":20},3,1,3,0,1,3,1,5,1,2,{"$f":"SUM(M402:M411)","v":20},null,{"$f":"SUM(P412:Y412)","v":20},1,2,5,0,0,2,2,3,2,3,{"$f":"SUM(Z402:Z411)","v":20},null,{"$f":"SUM(AC412:AL412)","v":20},3,1,2,0,5,1,1,4,2,1,{"$f":"SUM(AM402:AM411)","v":20},null,{"$f":"SUM(AP412:AY412)","v":20},1,4,3,0,0,6,0,4,1,1,{"$f":"SUM(AZ402:AZ411)","v":20},null,{"$f":"SUM(BC412:BL412)","v":20},1,3,3,1,0,3,3,2,2,2,{"$f":"SUM(BM402:BM411)","v":20},null,{"$f":"SUM(BP412:BY412)","v":20},2,1,0,3,2,3,3,2,3,1,{"$f":"SUM(BZ402:BZ411)","v":20},null,{"$f":"SUM(CC412:CL412)","v":20},1,4,1,3,2,1,0,3,3,2,{"$f":"SUM(CM402:CM411)","v":20},null,{"$f":"SUM(CP412:CY412)","v":20},1,4,1,3,2,1,0,3,3,2,{"$f":"SUM(CZ402:CZ411)","v":20}]
[null,null,"Lösung",null,null,null,null,null,null,null,null,null,null,null,null,"Lösung",null,null,null,null,null,null,null,null,null,null,null,null,"Lösung",null,null,null,null,null,null,null,null,null,null,null,null,"Lösung",null,null,null,null,null,null,null,null,null,null,null,null,"Lösung",null,null,null,null,null,null,null,null,null,null,null,null,"Lösung",null,null,null,null,null,null,null,null,null,null,null,null,"Lösung (erste)",null,null,null,null,null,null,null,null,null,null,null,null,"Lösung (zweite, offizielle)"]
[null,129,"k","w","w","w","x","l","w","w","x","x",5,null,130,"w","w","k","w","w","w","w","x","w","x",3,null,131,"w","w","x","w","w","w","w","k","w","w",2,null,132,"w","x","x","w","w","x","w","w","w","w",3,null,133,"w","w","x","w","w","w","w","w","x","x",3,null,134,"w","w","w","w","w","w","w","w","w","x",1,null,135,"x","w",2,2,"w","w","w","k","w","w",4,null,136,"w","w",2,2,"w","x","w","k","w","w",4]
[null,"Tagi, 30.09.21","w","w","w","w","w","w","w","w","w","w",0,null,"Tagi, 01.10.21","w","w","w","w","w","x","w","w","w","w",1,null,"Tagi, 02.10.21","x","w","x","w","w","w","w","w","w","w",2,null,"Tagi, 04.10.21","w","w","w","w","w","w","w","r","l","w",2,null,"Tagi, 05.10.21","w","w","w","w","w","w","w","w","w","w",0,null,"Tagi, 06.10.21","w","w","w","x","q","x",4,"w","w","w",4,null,"Tagi, 07.10.21","w","w","w","w","w","w","w","w","w","w",0,null,"07.10.21(zweite)","w","w","w","w","w","w","w","w","w","w",0]
[null,null,"w","w",3,"w","w","w","w",4,"w","w",2,null,null,"w","x","x","w","w","w","w","w","x","x",4,null,null,"w","w","w","w","w","w","w","w","w","w",0,null,null,"w","w","w","w","w","w","w","w","w","w",0,null,null,"w","w","w","w","w","w",3,"w","w","w",1,null,null,2,2,"w","w","w","w","w","w","w","w",2,null,null,"w",4,"w","x","w","x","w","w","w","w",3,null,null,"w",4,"w",2,"w","w","w","w","x","w",3]
[null,null,"w","w",3,"w","w","x","w",4,"w","w",3,null,null,"w","w","w","w","w","w","w","w","w","w",0,null,null,"k","w","w","w","x","w","w",3,"w","w",3,null,null,"w","x","w","w","w","x","w","w","w","x",3,null,null,"w","w","w","w","w","w",3,"w","w","w",1,null,null,"w","w","w","w","w","x","w","x","w","w",2,null,null,"w",4,"w","x","w","w","w","w","w","w",2,null,null,"w",4,"w",2,"w","w","w","w","w","w",2]
[null,null,"k","w",3,"w","w","w","w",4,"w","w",3,null,null,"w","w","w","w","w","w","w","w","w","w",0,null,null,"w","w","w","w","x","w","w",3,"w","w",2,null,null,"w","o","w","w","w","w","w","w","w","w",1,null,null,4,4,4,4,"w","w",3,"w","w","w",5,null,null,"w","w","w","w","w","w","w","x","w","w",1,null,null,"w",4,"w","w","w","w","w","w","w","w",1,null,null,"w",4,"w","w","w","w","w","w","w","w",1]
[null,null,"w","w","w","w","w","w","w",4,"w","w",1,null,null,"x","x","x","w","w","w","x","x","x","x",7,null,null,"w","w","w","w","x","w","w",3,"w","w",2,null,null,"w","w","w","w","w","w","w",3,"w","w",1,null,null,"w","w","w","w","w","w","w","w","w","x",1,null,null,"w","w","w","w","w","w","w","w","w","w",0,null,null,"w",4,"w","w","w","w","w",3,3,3,4,null,null,"w",4,"w","w","w","w","w",3,3,3,4]
[null,null,"w","w","w","w","w","w","w","w","w","w",0,null,null,"w","w","w","w","w","w","w","w","w","w",0,null,null,"w","w","w","w","x","w","w","w","w","w",1,null,null,"w","w","x","w","w",4,"w",3,"w","w",3,null,null,"w","u","w","w","w","w","w","u","w","w",2,null,null,"w","w","w","u","w","w","w","w","w","w",1,null,null,"w","w","w","w","w","w","w","w","w","w",0,null,null,"w","w","w","w","w","w","w","w","w","w",0]
[null,null,"w","w","w","w","w","w","w","w","w","x",1,null,null,"w","w","w","w","w","w","w","w","w","w",0,null,null,"x","l","w","w","w","w","w","w","x","x",4,null,null,"w","w","w","w","w",4,"w",3,"w","w",2,null,null,"w","x","w","w","w","x","w","o","w","w",3,null,null,"w","w","w","x","w","w","x","w",3,"w",3,null,null,"w","w","w","w","u","w","w",3,3,3,4,null,null,"w","w","w","w","u","w","w",3,3,3,4]
[null,null,"w","w","w","w","w","x","q","x","w","w",3,null,null,"w","w","x","w","w",3,3,3,"w","w",4,null,null,"w","w","w","w","w","w","w","w","w","w",0,null,null,"r","x","x","w","w",4,"w","w","w","w",4,null,null,"w","w","w","w","w","x","w","w","w","w",1,null,null,"x","w","w","w","w","w","w","w",3,"w",2,null,null,"w","w","w","w","o","w","w","w","w","w",1,null,null,"w","w","w","w","o","w","w","w","w","w",1]
[null,null,2,2,"w","w","w","w","w","w","w","w",2,null,null,"w","w","x","w","w","w","w","w","w","w",1,null,null,"w","w","w","w","x","q","x","w","x","w",4,null,null,"w","w","w","w","w","o","w","w","w","w",1,null,null,"w","w","x","w","w","x","w","w","x","w",3,null,null,"w","w","w","w",3,3,3,"w",3,"w",4,null,null,"w","w","w","w","w","w","w","w","x","w",1,null,null,"x","w","w","w","w","w","w","w","w","w",1]
[null,{"$f":"SUM(C424:L424)","v":20},3,1,3,0,1,3,1,5,1,2,{"$f":"SUM(M414:M423)","v":20},null,{"$f":"SUM(P424:Y424)","v":20},1,2,5,0,0,2,2,3,2,3,{"$f":"SUM(Z414:Z423)","v":20},null,{"$f":"SUM(AC424:AL424)","v":20},3,1,2,0,5,1,1,4,2,1,{"$f":"SUM(AM414:AM423)","v":20},null,{"$f":"SUM(AP424:AY424)","v":20},1,4,3,0,0,6,0,4,1,1,{"$f":"SUM(AZ414:AZ423)","v":20},null,{"$f":"SUM(BC424:BL424)","v":20},1,3,3,1,0,3,3,2,2,2,{"$f":"SUM(BM414:BM423)","v":20},null,{"$f":"SUM(BP424:BY424)","v":20},2,1,0,3,2,3,3,2,3,1,{"$f":"SUM(BZ414:BZ423)","v":20},null,{"$f":"SUM(CC424:CL424)","v":20},1,4,1,3,2,1,0,3,3,2,{"$f":"SUM(CM414:CM423)","v":20},null,{"$f":"SUM(CP424:CY424)","v":20},1,4,1,3,2,1,0,3,3,2,{"$f":"SUM(CZ414:CZ423)","v":20}]
[]
[null,null,"Tagi, 08.10.21",null,null,null,null,null,null,null,null,null,null,null,null,"Tagi, 09.10.21",null,null,null,null,null,null,null,null,null,null,null,null,"Tagi, 12.10.21",null,null,null,null,null,null,null,null,null,null,null,null,"Tagi, 12.10.21",null,null,null,null,null,null,null,null,null,null,null,null,"Tagi, 13.10.21",null,null,null,null,null,null,null,null,null,null,null,null,"Tagi, 14.10.21",null,null,null,null,null,null,null,null,null,null,null,null,"Tagi, 15.10.21",null,null,null,null,null,null,null,null,null,null,null,null,"Beobachter, 08.10.21"]
[null,137,null,"u",null,null,null,"k",null,null,null,null,2,null,138,null,null,null,null,null,null,null,null,null,null,1,null,139,null,null,"r",null,null,null,null,null,null,null,2,null,140,null,null,null,null,null,null,null,"r",null,null,4,null,141,null,null,"l",null,null,null,null,null,null,null,2,null,142,null,null,null,null,null,null,null,null,null,null,2,null,143,null,null,null,null,null,null,null,null,null,null,1,null,144,null,null,null,null,null,null,null,null,null,null,0]
[null,"Tagi, 08.10.21",null,null,null,null,null,null,null,null,null,null,5,null,"Tagi, 09.10.21",null,null,null,null,null,"o",null,"w",null,null,4,null,"Tagi, 12.10.21",null,null,null,null,null,null,null,null,null,null,2,null,"Tagi, 12.10.21",null,null,null,null,null,null,null,null,null,null,0,null,"Tagi, 13.10.21",null,null,null,null,null,"w",null,null,null,null,2,null,"Tagi, 14.10.21",null,null,null,null,null,null,null,null,null,null,3,null,"Tagi, 15.10.21",null,null,null,null,null,null,null,null,null,null,0,null,"Beobachter, 08.10.21",null,null,null,null,null,null,null,null,null,null,0]
[null,null,null,null,null,null,null,null,null,null,null,null,0,null,null,null,null,null,null,null,null,null,null,null,null,0,null,null,null,null,null,null,null,null,null,null,null,null,3,null,null,null,null,null,null,null,null,null,null,null,null,0,null,null,null,null,null,"u",null,null,null,null,null,null,1,null,null,null,null,null,null,null,null,null,null,null,null,2,null,null,null,null,null,"u",null,null,null,null,null,null,2,null,null,null,null,null,null,null,null,null,null,null,null,2]
[null,null,null,null,null,null,null,null,null,null,null,null,2,null,null,null,null,null,null,null,null,null,null,null,null,1,null,null,null,null,null,null,null,null,null,null,null,null,2,null,null,null,null,null,null,null,null,null,null,null,null,2,null,null,null,null,null,null,null,null,null,null,null,null,2,null,null,null,null,"r",null,null,null,null,null,null,null,3,null,null,null,null,null,null,null,null,null,null,"r",null,4,null,null,null,null,null,null,null,null,null,null,null,null,4]
[null,null,null,null,null,null,null,null,null,null,null,null,1,null,null,null,null,null,null,"l",null,null,null,null,null,2,null,null,null,null,null,null,null,null,null,null,null,null,1,null,null,null,null,null,null,null,null,null,null,null,null,2,null,null,null,null,null,null,null,null,null,null,null,null,1,null,null,null,null,null,null,null,null,null,null,null,null,0,null,null,null,null,null,null,null,null,null,null,null,null,2,null,null,null,null,null,null,null,null,null,null,"o",null,2]
[null,null,null,null,null,null,null,null,null,null,"k",null,4,null,null,null,null,null,null,null,null,null,null,null,null,4,null,null,null,null,null,null,null,null,null,null,null,null,1,null,null,null,null,null,null,null,null,null,"r",null,null,3,null,null,null,null,null,null,null,null,null,null,null,null,2,null,null,"k",null,null,null,null,null,null,null,null,null,1,null,null,null,null,null,null,null,null,null,null,null,null,0,null,null,null,null,null,null,null,null,null,null,null,null,1]
[null,null,null,null,null,null,null,null,null,null,null,null,1,null,null,null,"u",null,null,null,null,null,null,null,null,2,null,null,null,null,null,null,null,null,null,"o",null,null,1,null,null,null,null,null,null,null,null,null,null,null,null,2,null,null,null,null,null,null,null,null,null,null,null,null,3,null,null,null,null,null,null,null,null,null,null,"u",null,1,null,null,null,null,null,null,null,null,null,null,null,null,2,null,null,null,null,null,null,null,"q",null,null,null,null,5]
[null,null,null,null,null,null,null,"q",null,null,null,null,2,null,null,null,null,null,null,null,null,null,null,null,null,1,null,null,null,null,null,null,null,null,null,null,null,null,3,null,null,null,null,null,null,null,null,null,null,null,null,3,null,null,null,null,null,null,null,null,null,null,null,null,5,null,null,"w",null,null,null,null,null,null,null,null,null,4,null,null,null,"q",null,null,null,null,null,null,null,null,4,null,null,null,null,null,null,null,null,null,null,null,null,2]
[null,null,null,null,null,null,null,null,null,null,null,null,2,null,null,null,null,null,null,null,null,null,null,null,null,1,null,null,null,null,null,null,null,null,null,null,null,null,0,null,null,null,null,null,null,null,null,null,"w",null,null,2,null,null,null,null,null,null,null,null,null,null,null,null,0,null,null,null,null,null,null,null,null,null,null,null,null,2,null,null,null,null,null,null,null,null,null,null,null,null,3,null,null,null,null,null,null,null,null,null,null,null,null,0]
[null,null,null,null,null,null,null,null,null,null,null,null,1,null,null,null,null,null,null,null,null,null,null,null,null,4,null,null,null,"k",null,null,null,null,"r",null,null,null,5,null,null,"r",null,null,null,null,null,null,null,null,null,2,null,null,null,null,null,null,null,null,null,"k",null,null,2,null,null,null,null,null,null,null,null,null,null,null,null,2,null,null,null,null,null,null,null,null,null,"k",null,null,2,null,null,null,null,null,null,null,null,null,null,null,null,4]
[null,{"$f":"SUM(C437:L437)","v":20},1,5,1,1,0,7,0,1,2,2,{"$f":"SUM(M427:M436)","v":20},null,{"$f":"SUM(P437:Y437)","v":20},2,3,0,3,1,2,2,2,3,2,{"$f":"SUM(Z427:Z436)","v":20},null,{"$f":"SUM(AC437:AL437)","v":20},2,2,1,5,0,4,1,3,1,1,{"$f":"SUM(AM427:AM436)","v":20},null,{"$f":"SUM(AP437:AY437)","v":20},1,1,5,0,4,0,0,4,2,3,{"$f":"SUM(AZ427:AZ436)","v":20},null,{"$f":"SUM(BC437:BL437)","v":20},2,1,4,2,0,1,3,3,0,4,{"$f":"SUM(BM427:BM436)","v":20},null,{"$f":"SUM(BP437:BY437)","v":20},2,1,5,1,2,1,4,0,3,1,{"$f":"SUM(BZ427:BZ436)","v":20},null,{"$f":"SUM(CC437:CL437)","v":20},2,3,0,2,4,3,1,2,1,2,{"$f":"SUM(CM427:CM436)","v":20},null,{"$f":"SUM(CP437:CY437)","v":20},0,0,4,0,5,2,4,1,2,2,{"$f":"SUM(CZ427:CZ436)","v":20}]
[null,null,"Lösung",null,null,null,null,null,null,null,null,null,null,null,null,"Lösung",null,null,null,null,null,null,null,null,null,null,null,null,"Lösung",null,null,null,null,null,null,null,null,null,null,null,null,"Lösung",null,null,null,null,null,null,null,null,null,null,null,null,"Lösung",null,null,null,null,null,null,null,null,null,null,null,null,"Lösung",null,null,null,null,null,null,null,null,null,null,null,null,"Lösung",null,null,null,null,null,null,null,null,null,null,null,null,"Lösung"]
[null,137,"w","u","w","w","w","k","w","w","w","w",2,null,138,"w","w","w","w","w","u","w","w","w","w",1,null,139,"w","w","r","l","w","w","w","w","w","w",2,null,140,"w","w","x","w","w","w","w","r","x","x",4,null,141,"w","r","l","w","w","w","w","w","w","w",2,null,142,"w","w","w","w","x","w",4,"w","w","w",2,null,143,"x","w","w","w","w","w","w","w","w","w",1,null,144,"w","w","w","w","w","w","w","w","w","w",0]
[null,"Tagi, 08.10.21","w","x","w","x","w","w","w","x","x","x",5,null,"Tagi, 09.10.21","x","w","w","w","w","o","w","w","x","x",4,null,"Tagi, 12.10.21","x","w","w","w","w","x","w","w","w","w",2,null,"Tagi, 12.10.21","w","w","w","w","w","w","w","w","w","w",0,null,"Tagi, 13.10.21","w","w","w","w","w","w","x","x","w","w",2,null,"Tagi, 14.10.21","w",2,"x","w","w","w",4,"w","w","w",3,null,"Tagi, 15.10.21","w","w","w","w","w","w","w","w","w","w",0,null,"Beobachter, 08.10.21","w","w","w","w","w","w","w","w","w","w",0]
[null,null,"w","w","w","w","w","w","w","w","w","w",0,null,null,"w","w","w","w","w","w","w","w","w","w",0,null,null,"x","w","w","x","w","x","w","w","w","w",3,null,null,"w","w","w","w","w","w","w","w","w","w",0,null,null,"w","w","w","u","w","w","w","w","w","w",1,null,null,"w","w","w","w","w","w",4,"w","w","x",2,null,null,"w","w","w","u","w",3,"w","w","w","w",2,null,null,"w","w","w","w","x","w","x","w","w","w",2]
[null,null,"w","w","w","w","w","x","w","w","w","x",2,null,null,"x","w","w","w","w","w","w","w","w","w",1,null,null,"w","w","w","x","w","x","w","w","w","w",2,null,null,"w","w","x","w","w","w","w","x","w","w",2,null,null,"w","w","w","o","w","w","x","w","w","w",2,null,null,"w","w","r","x","w","w",4,"w","w","w",3,null,null,"w","w","w","o","w",3,"w","w","r","x",4,null,null,"w","w","x","w","x","w","x","w","u","w",4]
[null,null,"w","w","w","w","w","x","w","w","w","w",1,null,null,"w","w","w","r","l","w","w","w","w","w",2,null,null,"w","w","w","x","w","w","w","w","w","w",1,null,null,"w","w","x","w","x","w","w","w","w","w",2,null,null,"w","w","w","w","w","w","w","w","w","x",1,null,null,"w","w","w","w","w","w","w","w","w","w",0,null,null,"x","w","w","w","w",3,"w","w","w","w",2,null,null,"w","w","w","w","x","w","w","w","o","w",2]
[null,null,"x","x","x","w","w","w","w","w","k","w",4,null,null,"w","w","w","w","w","w","x","x","x","x",4,null,null,"w","w","w","w","w","w","w","x","w","w",1,null,null,"w","w","x","w","w","w","w","r","x","w",3,null,null,"w","w",3,"w","w","w","w","w","w","x",2,null,null,"k","w","w","w","w","w","w","w","w","w",1,null,null,"w","w","w","w","w","w","w","w","w","w",0,null,null,"w","w","x","w","w","w","w","w","w","w",1]
[null,null,"w","w","w","w","w",4,"w","w","w","w",1,null,null,"w","u","w","x","w","w","w","w","w","w",2,null,null,"w","w","w","w","w","w","w","o","w","w",1,null,null,"w","w","x","w","x","w","w","w","w","w",2,null,null,"x","w",3,"w","w","w","w","w","w","x",3,null,null,"w","w","w","w","w","w","w","w","u","w",1,null,null,"w","x","w","w",4,"w","w","w","w","w",2,null,null,"w","w","w","w","x","x","x","x","w",2,5]
[null,null,"w",2,"w","w","w","q","w","w","w","w",2,null,null,"w",3,"w","w","w","w","w","w","w","w",1,null,null,"w","x","w","x","w","x","w","w","w","w",3,null,null,"w","w","w","w","x","w","w","x","w","x",3,null,null,"w","w",3,"w","w",3,3,3,"w","x",5,null,null,"w","w",3,"w","x","x","w","w",3,"w",4,null,null,"w","q","w","w",4,"w","x","x","w","w",4,null,null,"w","w","x","w","w","w","w","w","w",2,2]
[null,null,"w",2,"w","w","w","x","w","w","w","w",2,null,null,"w",3,"w","w","w","w","w","w","w","w",1,null,null,"w","w","w","w","w","w","w","w","w","w",0,null,null,"w","w","w","w","x","w","w","w","w","x",2,null,null,"w","w","w","w","w","w","w","w","w","w",0,null,null,"w","w",3,"w","w","w","w","w",3,"w",2,null,null,"w","x","w","w",4,"w","w","w","w","x",3,null,null,"w","w","w","w","w","w","w","w","w","w",0]
[null,null,"w","w","w","w","w","x","w","w","w","w",1,null,null,"w","w","w","x","w","w","x",3,3,"w",4,null,null,"w","k","w","w","w","w","x","x","x","x",5,null,null,"r","l","w","w","w","w","w","w","w","w",2,null,null,"x","w","w","w","w","w","w","k","w","w",2,null,null,"x","w",3,"w","w","w","w","w","w","w",2,null,null,"w","w","w","w",4,"w","w","k","w","w",2,null,null,"w","w","x","w","x","x","x","w","w","w",4]
[null,{"$f":"SUM(C449:L449)","v":20},1,5,1,1,0,7,0,1,2,2,{"$f":"SUM(M439:M448)","v":20},null,{"$f":"SUM(P449:Y449)","v":20},2,3,0,3,1,2,2,2,3,2,{"$f":"SUM(Z439:Z448)","v":20},null,{"$f":"SUM(AC449:AL449)","v":20},2,2,1,5,0,4,1,3,1,1,{"$f":"SUM(AM439:AM448)","v":20},null,{"$f":"SUM(AP449:AY449)","v":20},1,1,5,0,4,0,0,4,2,3,{"$f":"SUM(AZ439:AZ448)","v":20},null,{"$f":"SUM(BC449:BL449)","v":20},2,1,4,2,0,1,3,3,0,4,{"$f":"SUM(BM439:BM448)","v":20},null,{"$f":"SUM(BP449:BY449)","v":20},2,1,5,1,2,1,4,0,3,1,{"$f":"SUM(BZ439:BZ448)","v":20},null,{"$f":"SUM(CC449:CL449)","v":20},2,3,0,2,4,3,1,2,1,2,{"$f":"SUM(CM439:CM448)","v":20},null,{"$f":"SUM(CP449:CY449)","v":20},0,0,4,0,5,2,4,1,2,2,{"$f":"SUM(CZ439:CZ448)","v":20}]
[]
[null,null,"Tagi, 18.10.21",null,null,null,null,null,null,null,null,null,null,null,null,"Tagi, 19.10.21",null,null,null,null,null,null,null,null,null,null,null,null,"Tagi, 20.10.21",null,null,null,null,null,null,null,null,null,null,null,null,"Tagi, 21.10.21",null,null,null,null,null,null,null,null,null,null,null,null,"Tagi, 22.10.21",null,null,null,null,null,null,null,null,null,null,null,null,"Tagi, 23.10.21",null,null,null,null,null,null,null,null,null,null,null,null,"Tagi, 25.10.21",null,null,null,null,null,null,null,null,null,null,null,null,"Tagi, 26.10.21"]
[null,145,null,null,"k",null,null,null,null,null,null,null,3,null,146,null,null,null,null,null,null,null,null,"l",null,4,null,147,null,null,null,"k",null,null,"u",null,null,null,4,null,148,null,"w",null,null,null,null,null,null,null,null,4,null,149,null,null,null,null,null,null,null,null,null,"l",3,null,150,null,null,null,null,null,"k",null,null,null,"w",3,null,151,null,null,null,null,null,null,null,null,null,null,3,null,152,null,null,null,null,null,null,null,null,null,null,4]
[null,"Tagi, 18.10.21",null,null,null,null,null,null,null,null,null,null,4,null,"Tagi, 19.10.21",null,null,null,null,null,null,null,null,null,null,0,null,"Tagi, 20.10.21",null,null,null,null,null,null,null,null,null,null,2,null,"Tagi, 21.10.21",null,null,null,null,null,null,null,null,null,null,2,null,"Tagi, 22.10.21",null,null,null,null,null,null,null,null,null,null,2,null,"Tagi, 23.10.21",null,null,null,null,null,null,null,null,null,null,0,null,"Tagi, 25.10.21","k",null,null,null,null,null,null,null,null,null,3,null,"Tagi, 26.10.21",null,null,null,null,null,null,null,null,null,null,0]
[null,null,null,null,null,null,null,null,"u",null,null,null,2,null,null,null,null,null,null,null,null,null,null,null,null,4,null,null,null,null,null,null,null,null,null,null,null,null,0,null,null,null,null,"r",null,null,null,null,null,null,null,6,null,null,null,null,null,null,"o",null,null,null,null,null,3,null,null,null,null,null,null,null,null,null,null,null,null,6,null,null,null,null,null,null,null,null,null,null,null,null,1,null,null,null,null,null,null,null,null,null,null,null,null,2]
[null,null,null,null,null,"k",null,null,null,null,null,null,2,null,null,null,null,null,null,null,null,null,null,null,null,1,null,null,"k",null,null,null,null,null,null,null,null,null,5,null,null,null,null,null,null,null,null,null,null,null,null,0,null,null,"r",null,null,null,null,null,null,null,null,null,2,null,null,null,null,null,null,null,null,null,null,null,null,0,null,null,null,null,null,null,null,null,null,null,null,null,0,null,null,null,null,null,null,null,null,null,null,null,null,1]
[null,null,"k",null,null,null,null,null,null,null,null,null,3,null,null,null,null,null,null,"o",null,null,null,null,null,1,null,null,null,null,null,null,null,null,null,null,null,null,3,null,null,null,null,null,null,null,null,null,null,null,null,1,null,null,null,null,null,null,null,null,null,null,null,null,1,null,null,null,null,null,null,null,null,null,null,null,null,0,null,null,null,"k",null,null,null,null,null,null,null,null,1,null,null,"r",null,null,null,null,null,null,null,null,null,5]
[null,null,null,null,null,null,null,null,null,null,null,null,1,null,null,null,null,null,null,null,null,null,null,null,null,1,null,null,null,null,null,null,null,null,null,null,null,null,0,null,null,null,null,null,"k",null,null,null,null,null,null,1,null,null,null,null,null,null,null,null,null,null,null,null,2,null,null,null,null,null,null,null,null,null,null,null,null,3,null,null,null,null,null,null,null,null,null,null,null,null,2,null,null,null,null,null,null,null,null,null,null,null,null,1]
[null,null,null,null,null,null,null,null,null,null,null,null,0,null,null,"u",null,null,null,null,null,null,null,null,null,3,null,null,null,null,null,null,null,null,null,null,null,null,1,null,null,null,null,null,null,null,null,null,null,null,null,0,null,null,null,null,null,null,null,null,null,null,null,null,1,null,null,null,null,null,null,null,null,null,null,null,null,2,null,null,null,"r",null,null,null,null,null,null,null,null,4,null,null,null,null,null,null,null,null,null,null,null,null,0]
[null,null,null,null,null,null,null,null,null,null,null,null,1,null,null,null,null,null,null,null,null,null,null,null,null,3,null,null,null,null,null,null,null,null,null,null,null,null,1,null,null,null,null,null,null,null,"r",null,null,null,null,2,null,null,null,null,null,null,null,null,null,null,null,null,0,null,null,"q",null,null,null,null,null,null,null,null,null,3,null,null,null,null,null,null,null,null,null,null,null,null,2,null,null,null,null,null,null,null,null,"k",null,null,null,1]
[null,null,null,null,null,null,null,null,null,null,null,null,1,null,null,null,null,null,null,null,"l",null,null,null,null,2,null,null,null,null,null,null,null,null,null,null,null,null,1,null,null,null,null,null,null,null,null,null,null,null,null,0,null,null,null,null,null,null,null,null,null,null,null,null,4,null,null,null,null,"u",null,null,null,null,null,null,null,2,null,null,null,null,null,null,null,null,null,"u",null,null,2,null,null,null,null,null,null,null,null,null,null,null,null,2]
[null,null,null,null,null,null,null,null,null,null,null,null,3,null,null,null,null,null,null,null,null,null,null,null,null,1,null,null,null,null,null,null,null,null,null,null,null,null,3,null,null,null,null,null,null,null,null,null,null,null,null,4,null,null,null,null,null,"k",null,null,null,null,null,null,2,null,null,null,null,null,null,null,null,null,null,null,null,1,null,null,null,null,null,null,null,null,null,null,null,null,2,null,null,null,null,null,"r",null,null,null,null,null,null,4]
[null,{"$f":"SUM(C462:L462)","v":20},4,0,4,1,2,1,5,0,1,2,{"$f":"SUM(M452:M461)","v":20},null,{"$f":"SUM(P462:Y462)","v":20},3,0,0,0,5,2,1,2,2,5,{"$f":"SUM(Z452:Z461)","v":20},null,{"$f":"SUM(AC462:AL462)","v":20},3,3,1,2,2,3,2,1,1,2,{"$f":"SUM(AM452:AM461)","v":20},null,{"$f":"SUM(AP462:AY462)","v":20},1,1,3,2,2,5,1,2,0,3,{"$f":"SUM(AZ452:AZ461)","v":20},null,{"$f":"SUM(BC462:BL462)","v":20},3,1,0,2,3,4,1,2,3,1,{"$f":"SUM(BM452:BM461)","v":20},null,{"$f":"SUM(BP462:BY462)","v":20},3,0,4,1,2,3,3,1,0,3,{"$f":"SUM(BZ452:BZ461)","v":20},null,{"$f":"SUM(CC462:CL462)","v":20},1,2,1,1,3,0,4,2,2,4,{"$f":"SUM(CM452:CM461)","v":20},null,{"$f":"SUM(CP462:CY462)","v":20},1,4,3,4,1,0,4,2,0,1,{"$f":"SUM(CZ452:CZ461)","v":20}]
[null,null,"Lösung",null,null,null,null,null,null,null,null,null,null,null,null,"Lösung",null,null,null,null,null,null,null,null,null,null,null,null,"Lösung",null,null,null,null,null,null,null,null,null,null,null,null,"Lösung",null,null,null,null,null,null,null,null,null,null,null,null,"Lösung",null,null,null,null,null,null,null,null,null,null,null,null,"Lösung",null,null,null,null,null,null,null,null,null,null,null,null,"Lösung",null,null,null,null,null,null,null,null,null,null,null,null,"Lösung"]
[null,145,3,"w","k","w",2,"w","w","w","w","w",3,null,146,"w","w","w","w","w",4,4,4,"l","w",4,null,147,"x","w","w","k","w","w","u","w","w","x",4,null,148,"w","w","x","w","x","x","w","w","w",3,4,null,149,"w","w","w","w","x","w","w","w","x","l",3,null,150,"w","w","x","x","w","k","w","w","w","w",3,null,151,"w","w","w","x","w","w",3,"w","x","w",3,null,152,"w","x","x","x","w","w","w","x","w","w",4]
[null,"Tagi, 18.10.21",3,"w","w","w",2,"w","w","w","x","x",4,null,"Tagi, 19.10.21","w","w","w","w","w","w","w","w","w","w",0,null,"Tagi, 20.10.21","x","w","w","w","w","w","o","w","w","w",2,null,"Tagi, 21.10.21","w","w","w","w","w","w","w","x","w",3,2,null,"Tagi, 22.10.21","x","w","w","w","x","w","w","w","w","w",2,null,"Tagi, 23.10.21","w","w","w","w","w","w","w","w","w","w",0,null,"Tagi, 25.10.21","k","w","w","w","w","w",3,"w","x","w",3,null,"Tagi, 26.10.21","w","w","w","w","w","w","w","w","w","w",0]
[null,null,3,"w","w","w","w","w",4,"w","w","w",2,null,null,"x","w","w","w","x","w","w","w","x","x",4,null,null,"w","w","w","w","w","w","w","w","w","w",0,null,null,"w","w",4,4,4,4,"w","x","w",3,6,null,null,"w","w","w","w","o","w","w","x","x","w",3,null,null,"w","w","x","w","x","x","x","x","w","x",6,null,null,"w","w","w","w","w","w",3,"w","w","w",1,null,null,"w","w","x","x","w","w","w","w","w","w",2]
[null,null,"w","w","w","k","w","w",4,"w","w","w",2,null,null,"w","w","w","w","x","w","w","w","w","w",1,null,null,"k","w",4,4,4,4,"w","w","w","w",5,null,null,"w","w","w","w","w","w","w","w","w","w",0,null,null,"r","l","w","w","w","w","w","w","w","w",2,null,null,"w","w","w","w","w","w","w","w","w","w",0,null,null,"w","w","w","w","w","w","w","w","w","w",0,null,null,"w","w","w","w","w","w",3,"w","w","w",1]
[null,null,"k","w","w","w","w","w",4,"w","w","x",3,null,null,"w","w","w","w","o","w","w","w","w","w",1,null,null,"w","w","w","w","w","w","w","x","x","x",3,null,null,"w","w","w","w","w","x","w","w","w","w",1,null,null,"w","w","w","w","w","x","w","w","w","w",1,null,null,"w","w","w","w","w","w","w","w","w","w",0,null,null,"w","k","w","w","w","w","w","w","w","w",1,null,null,"r","x","x","x","w","w",3,"w","w","w",5]
[null,null,"w","w","w","w","w","w",4,"w","w","w",1,null,null,"w","w","w","w","w","w","w","w","w","x",1,null,null,"w","w","w","w","w","w","w","w","w","w",0,null,null,"w","w","w","k","w","w","w","w","w","w",1,null,null,"w","w","w","x","w","x","w","w","w","w",2,null,null,"w","w","w","w",3,3,3,"w","w","w",3,null,null,"w","w","w","w",3,"w","x","w","w","w",2,null,null,"w","w","w","w","w","w",3,"w","w","w",1]
[null,null,"w","w","w","w","w","w","w","w","w","w",0,null,null,"u","w","w","w","x","w","w","w","w","x",3,null,null,"w","w","w","w","w","x","w","w","w","w",1,null,null,"w","w","w","w","w","w","w","w","w","w",0,null,null,"w","w","w","w","w","x","w","w","w","w",1,null,null,"x","w","w","w","w","w","w","w","w","x",2,null,null,"w","r","x","w",3,"w","w","w","w",4,4,null,null,"w","w","w","w","w","w","w","w","w","w",0]
[null,null,"w","w","x","w","w","w","w","w","w","w",1,null,null,"x","w","w","w","w","w","w","x","w","x",3,null,null,"w",3,"w","w","w","w","w","w","w","w",1,null,null,"w","w","w","w","w","r","l","w","w","w",2,null,null,"w","w","w","w","w","w","w","w","w","w",0,null,null,"q","w","w","w","w","w","x","w","w","x",3,null,null,"w","w","w","w",3,"w","w","w","w",4,2,null,null,"w","w","w","w","w","w","k","w","w","w",1]
[null,null,"w","w","x","w","w","w","w","w","w","w",1,null,null,"w","w","w","w","r","l","w","w","w","w",2,null,null,"w",3,"w","w","w","w","w","w","w","w",1,null,null,"w","w","w","w","w","w","w","w","w","w",0,null,null,"w","w","w","w","w",4,4,4,4,"w",4,null,null,"x","w","u","w","w","w","w","w","w","w",2,null,null,"w","w","w","w","w","w","w","u","w",4,2,null,null,"w","x","w","w","w","w","w","w","w","x",2]
[null,null,"w","w","x","w","w",2,"x","w","w","w",3,null,null,"w","w","w","w","w","w","w","w","w","x",1,null,null,"w","x","w","w","x","x","w","w","w","w",3,null,null,3,3,3,"w","w","x","w","w","w","w",4,null,null,"x","w","w","k","w","w","w","w","w","w",2,null,null,"w","w","x","w","w","w","w","w","w","w",1,null,null,"w","w","w","w","w","w","w","o","w","x",2,null,null,"w","x","w","r","x","w","w","x","w","w",4]
[null,{"$f":"SUM(C474:L474)","v":20},4,0,4,1,2,1,5,0,1,2,{"$f":"SUM(M464:M473)","v":20},null,{"$f":"SUM(P474:Y474)","v":20},3,0,0,0,5,2,1,2,2,5,{"$f":"SUM(Z464:Z473)","v":20},null,{"$f":"SUM(AC474:AL474)","v":20},3,3,1,2,2,3,2,1,1,2,{"$f":"SUM(AM464:AM473)","v":20},null,{"$f":"SUM(AP474:AY474)","v":20},1,1,3,2,2,5,1,2,0,3,{"$f":"SUM(AZ464:AZ473)","v":20},null,{"$f":"SUM(BC474:BL474)","v":20},3,1,0,2,3,4,1,2,3,1,{"$f":"SUM(BM464:BM473)","v":20},null,{"$f":"SUM(BP474:BY474)","v":20},3,0,4,1,2,3,3,1,0,3,{"$f":"SUM(BZ464:BZ473)","v":20},null,{"$f":"SUM(CC474:CL474)","v":20},1,2,1,1,3,0,4,2,2,4,{"$f":"SUM(CM464:CM473)","v":20},null,{"$f":"SUM(CP474:CY474)","v":20},1,4,3,4,1,0,4,2,0,1,{"$f":"SUM(CZ464:CZ473)","v":20}]
[]
[null,null,"Tagi, 27.10.21",null,null,null,null,null,null,null,null,null,null,null,null,"Tagi, 28.10.21",null,null,null,null,null,null,null,null,null,null,null,null,"Tagi, 29.10.21",null,null,null,null,null,null,null,null,null,null,null,null,"Tagi, 30.10.21",null,null,null,null,null,null,null,null,null,null,null,null,"Tagi, 01.11.21",null,null,null,null,null,null,null,null,null,null,null,null,"Tagi, 02.11.21",null,null,null,null,null,null,null,null,null,null,null,null,"Tagi, 03.11.21",null,null,null,null,null,null,null,null,null,null,null,null,"Tagi, 04.11.21"]
[null,153,null,null,null,null,null,null,null,null,null,null,2,null,154,null,null,null,null,null,null,null,null,"u",null,2,null,155,null,null,null,null,null,null,null,null,null,null,1,null,156,null,null,null,null,null,null,null,null,null,"l",3,null,157,null,null,null,null,null,null,null,null,null,null,1,null,158,null,null,null,null,null,null,null,null,null,null,2,null,159,null,"q",null,null,null,null,null,null,null,null,3,null,160,null,null,null,null,null,null,null,null,null,null,1]
[null,"Tagi, 27.10.21",null,null,null,null,null,null,null,null,null,null,1,null,"Tagi, 28.10.21",null,null,null,null,null,null,null,null,null,null,2,null,"Tagi, 29.10.21",null,null,null,null,null,null,null,null,null,null,3,null,"Tagi, 30.10.21",null,null,null,null,"w",null,null,null,null,null,2,null,"Tagi, 01.11.21",null,null,null,null,null,null,null,null,null,null,3,null,"Tagi, 02.11.21",null,"q",null,null,null,null,null,null,null,null,6,null,"Tagi, 03.11.21",null,null,null,null,null,null,null,null,null,null,1,null,"Tagi, 04.11.21",null,null,null,null,null,null,null,null,null,null,1]
[null,null,"r",null,null,null,null,null,null,null,null,null,2,null,null,null,null,null,null,"o",null,null,null,null,null,2,null,null,null,null,null,null,null,null,null,null,null,null,3,null,null,null,null,null,null,null,null,null,null,null,null,0,null,null,null,null,"q",null,null,null,null,null,null,null,1,null,null,null,null,null,null,null,null,null,null,null,null,0,null,null,null,null,null,null,null,null,null,null,"k",null,1,null,null,null,null,null,null,null,null,null,null,null,null,3]
[null,null,null,null,null,null,null,null,null,null,null,null,4,null,null,null,null,null,null,null,null,null,null,null,null,4,null,null,null,null,null,null,null,null,null,null,null,null,1,null,null,null,null,null,null,null,null,null,null,null,null,2,null,null,null,null,null,null,null,null,null,null,null,null,2,null,null,null,null,null,null,null,null,null,null,"k",null,3,null,null,null,null,null,null,null,null,null,null,null,null,0,null,null,null,null,null,null,null,"k",null,null,null,null,2]
[null,null,null,null,null,null,null,null,null,null,null,null,0,null,null,null,null,null,null,null,null,null,null,null,null,3,null,null,null,null,null,null,null,null,"k",null,"w",null,2,null,null,null,null,null,null,null,null,null,null,null,null,1,null,null,"w",null,null,null,null,null,"w",null,null,null,2,null,null,null,null,null,null,null,null,null,null,null,null,1,null,null,null,null,null,null,null,null,"l",null,null,null,6,null,null,null,null,null,null,null,null,null,null,null,null,2]
[null,null,null,null,null,null,null,null,null,null,null,null,3,null,null,null,null,null,null,null,null,null,null,null,null,0,null,null,null,null,null,null,null,null,null,null,null,null,3,null,null,null,null,null,"q",null,null,null,null,null,null,2,null,null,null,null,null,null,null,null,null,null,null,null,1,null,null,null,null,null,null,null,null,null,null,null,null,2,null,null,null,null,null,null,null,null,null,null,null,null,0,null,null,null,null,null,null,null,null,null,null,null,null,3]
[null,null,null,null,null,null,null,null,null,null,null,null,2,null,null,null,null,null,null,null,null,null,null,null,null,0,null,null,null,null,null,null,null,null,null,null,null,null,0,null,null,null,null,null,null,null,null,null,null,null,null,4,null,null,null,null,null,null,null,null,null,null,null,null,0,null,null,null,null,null,null,null,null,null,null,null,null,3,null,null,null,null,null,null,null,null,null,null,null,null,2,null,null,null,null,null,null,null,null,null,null,null,null,1]
[null,null,null,null,null,null,null,null,null,null,null,null,1,null,null,null,null,null,null,null,null,null,null,null,null,3,null,null,null,null,null,null,null,null,null,null,null,null,2,null,null,null,null,null,null,null,null,null,null,null,null,0,null,null,null,null,null,null,null,null,null,null,null,null,5,null,null,"o",null,null,null,null,null,null,null,null,null,2,null,null,null,null,null,null,null,"l",null,null,null,null,5,null,null,"w",null,null,"q",null,null,null,null,null,null,4]
[null,null,null,null,null,"l",null,null,null,null,null,null,4,null,null,null,null,null,"k",null,null,null,null,null,null,3,null,null,null,null,null,null,null,null,null,null,"o",null,2,null,null,null,null,null,"q",null,null,null,null,null,null,5,null,null,null,null,null,null,null,null,null,null,null,null,2,null,null,null,null,null,null,null,null,null,null,null,null,0,null,null,null,null,null,null,null,null,null,null,null,null,0,null,null,null,null,null,null,null,null,null,null,null,null,2]
[null,null,null,null,null,null,null,null,null,"k",null,null,1,null,null,null,null,null,null,null,"k",null,null,null,null,1,null,null,null,null,"l",null,null,null,null,null,null,null,3,null,null,null,null,null,null,null,null,null,null,null,null,1,null,null,null,null,null,null,null,null,null,null,null,null,3,null,null,null,null,null,null,null,null,null,null,null,null,1,null,null,null,null,null,null,null,null,null,null,null,null,2,null,null,null,null,null,null,null,null,"w",null,null,null,1]
[null,{"$f":"SUM(C487:L487)","v":20},1,1,1,3,0,4,1,3,4,2,{"$f":"SUM(M477:M486)","v":20},null,{"$f":"SUM(P487:Y487)","v":20},2,1,2,1,3,2,2,1,3,3,{"$f":"SUM(Z477:Z486)","v":20},null,{"$f":"SUM(AC487:AL487)","v":20},1,3,6,1,2,1,1,0,4,1,{"$f":"SUM(AM477:AM486)","v":20},null,{"$f":"SUM(AP487:AY487)","v":20},3,1,2,5,2,2,1,2,1,1,{"$f":"SUM(AZ477:AZ486)","v":20},null,{"$f":"SUM(BC487:BL487)","v":20},2,0,3,4,2,1,3,1,1,3,{"$f":"SUM(BM477:BM486)","v":20},null,{"$f":"SUM(BP487:BY487)","v":20},3,1,2,1,3,2,0,1,1,6,{"$f":"SUM(BZ477:BZ486)","v":20},null,{"$f":"SUM(CC487:CL487)","v":20},3,2,1,1,2,4,1,1,3,2,{"$f":"SUM(CM477:CM486)","v":20},null,{"$f":"SUM(CP487:CY487)","v":20},1,2,0,7,0,2,5,1,0,2,{"$f":"SUM(CZ477:CZ486)","v":20}]
[null,null,"Lösung",null,null,null,null,null,null,null,null,null,null,null,null,"Lösung",null,null,null,null,null,null,null,null,null,null,null,null,"Lösung",null,null,null,null,null,null,null,null,null,null,null,null,"Lösung",null,null,null,null,null,null,null,null,null,null,null,null,"Lösung",null,null,null,null,null,null,null,null,null,null,null,null,"Lösung",null,null,null,null,null,null,null,null,null,null,null,null,"Lösung",null,null,null,null,null,null,null,null,null,null,null,null,"Lösung"]
[null,153,"w","w","w","x","w","w","w","w","x","w",2,null,154,"w","w","w","w",3,"w","w","w","u","w",2,null,155,"w","w","x","w","w","w","w","w","w","w",1,null,156,"w","w","w","w","x","w","w","w","x","l",3,null,157,"w","w","w","w","x","w","w","w","w","w",1,null,158,"w","w","w","w","w","x","w","w","w","x",2,null,159,"x","q","x","w","w","w","w","w","w","w",3,null,160,"w","w","w","w","w","w","x","w","w","w",1]
[null,"Tagi, 27.10.21","w","w","w","w","w","w","w","w","x","w",1,null,"Tagi, 28.10.21","w","w","w","w",3,"w","w","w","x","w",2,null,"Tagi, 29.10.21","w","w","x","w",2,"w","w","w","x","w",3,null,"Tagi, 30.10.21","w",2,"x","w","w","w","w","w","w","w",2,null,"Tagi, 01.11.21","w","w","x","w","x","w","x","w","w","w",3,null,"Tagi, 02.11.21","x","q",4,4,"w","x","w","w","w","x",6,null,"Tagi, 03.11.21","w","w","w","w","w","x","w","w","w","w",1,null,"Tagi, 04.11.21","w","w","w","w","w","w","x","w","w","w",1]
[null,null,"r","l","w","w","w","w","w","w","w","w",2,null,null,"w","w","x","w",3,"w","w","w","w","w",2,null,null,"w","w","x","w",2,"w","w","w","x","w",3,null,null,"w","w","w","w","w","w","w","w","w","w",0,null,null,"w","w","q","w","w","w","w","w","w","w",1,null,null,"w","w","w","w","w","w","w","w","w","w",0,null,null,"w","w","w","w","w","w","w","w","k","w",1,null,null,2,2,"w","x","w","w","w","w","w","w",3]
[null,null,"w","w","w","w","w","x","x","x","x","w",4,null,null,"w","w","w","w","w","w",4,4,4,4,4,null,null,"w","w","x","w","w","w","w","w","w","w",1,null,null,"w","w","w","x","w","x","w","w","w","w",2,null,null,"w","w","x","w","w","w","w","w","w",2,2,null,null,"w","w","x","w","x","w","w","w","k","w",3,null,null,"w","w","w","w","w","w","w","w","w","w",0,null,null,"w","w","w","x","w","k","w","w","w","w",2]
[null,null,"w","w","w","w","w","w","w","w","w","w",0,null,null,3,3,3,"w","w","w","w","w","w","w",3,null,null,"w","w","w","w","w","w","k","w","w","x",2,null,null,"w","w","w","x","w","w","w","w","w","w",1,null,null,"w","w","w","w","w","x","w","w","w",2,2,null,null,"w","w","w","w",3,"w","w","w","w","w",1,null,null,"w","w","w",4,4,4,4,"w",2,2,6,null,null,"w","w","w","x","w","w","w","w","w","x",2]
[null,null,"w","w","w","w","w","w","w",3,3,3,3,null,null,"w","w","w","w","w","w","w","w","w","w",0,null,null,"w","x",3,"x","w","w","w","w","w","w",3,null,null,"x","w","w","q","w","w","w","w","w","w",2,null,null,"w","w","w","x","w","w","w","w","w","w",1,null,null,"w","w","w","w",3,"w","w","w","w","x",2,null,null,"w","w","w","w","w","w","w","w","w","w",0,null,null,"w","w","w","w","w",3,3,3,"w","w",3]
[null,null,"w","w","w","x","w",3,"w","w","w","w",2,null,null,"w","w","w","w","w","w","w","w","w","w",0,null,null,"w","w","w","w","w","w","w","w","w","w",0,null,null,"w","w","w","x","w",3,3,3,"w","w",4,null,null,"w","w","w","w","w","w","w","w","w","w",0,null,null,"x","w","w","w","w","w","w","x","w","x",3,null,null,"x","x","w","w","w","w","w","w","w","w",2,null,null,"w","w","w","x","w","w","w","w","w","w",1]
[null,null,"w","w","w","w","w",3,"w","w","w","w",1,null,null,"w","w","w","w","w","x","x","w","w","x",3,null,null,"w","x","w","w","w","w","w","w","x","w",2,null,null,"w","w","w","w","w","w","w","w","w","w",0,null,null,"w","w","w","x","w","w",4,4,4,4,5,null,null,"o","w","w","w","w","w","w","w","w","x",2,null,null,"w","w","w","w","x","l","w",3,3,3,5,null,null,"w","x","w","x","w","w","x","w","w","x",4]
[null,null,"w","w","x","l","w","x","w","w","w","x",4,null,null,"x","w","w","k","w","w","w","w","w","x",3,null,null,"w","w","w","w","w","x","w","w","o","w",2,null,null,"x","w","x","q","x","w","w","x","w","w",5,null,null,2,"w","w","x","w","w","w","w","w","w",2,null,null,"w","w","w","w","w","w","w","w","w","w",0,null,null,"w","w","w","w","w","w","w","w","w","w",0,null,null,"w","w","w","x","w","w","x","w","w","w",2]
[null,null,"w","w","w","w","w","w","w","k","w","w",1,null,null,"w","w","w","w","w","k","w","w","w","w",1,null,null,3,3,3,"w","w","w","w","w","w","w",3,null,null,"x","w","w","w","w","w","w","w","w","w",1,null,null,2,"w","w","x","w","w","x","w","w","w",3,null,null,"w","w","w","w","w","w","w","w","w","x",1,null,null,"x","w","w","w","w","x","w","w","w","w",2,null,null,"w","w","w","x","w","w","w","w","w","w",1]
[null,{"$f":"SUM(C499:L499)","v":20},1,1,1,3,0,4,1,3,4,2,{"$f":"SUM(M489:M498)","v":20},null,{"$f":"SUM(P499:Y499)","v":20},2,1,2,1,3,2,2,1,3,3,{"$f":"SUM(Z489:Z498)","v":20},null,{"$f":"SUM(AC499:AL499)","v":20},1,3,6,1,2,1,1,0,4,1,{"$f":"SUM(AM489:AM498)","v":20},null,{"$f":"SUM(AP499:AY499)","v":20},3,1,2,5,2,2,1,2,1,1,{"$f":"SUM(AZ489:AZ498)","v":20},null,{"$f":"SUM(BC499:BL499)","v":20},2,0,3,4,2,1,3,1,1,3,{"$f":"SUM(BM489:BM498)","v":20},null,{"$f":"SUM(BP499:BY499)","v":20},3,1,2,1,3,2,0,1,1,6,{"$f":"SUM(BZ489:BZ498)","v":20},null,{"$f":"SUM(CC499:CL499)","v":20},3,2,1,1,2,4,1,1,3,2,{"$f":"SUM(CM489:CM498)","v":20},null,{"$f":"SUM(CP499:CY499)","v":20},1,2,0,7,0,2,5,1,0,2,{"$f":"SUM(CZ489:CZ498)","v":20}]
[]
[null,null,"Tagi, 05.11.21",null,null,null,null,null,null,null,null,null,null,null,null,"Beobachter, 05.11.21",null,null,null,null,null,null,null,null,null,null,null,null,"Tagi, 06.11.21",null,null,null,null,null,null,null,null,null,null,null,null,"Tagi, 08.11.21",null,null,null,null,null,null,null,null,null,null,null,null,"Tagi, 09.11.21",null,null,null,null,null,null,null,null,null,null,null,null,"Tagi, 10.11.21",null,null,null,null,null,null,null,null,null,null,null,null,"Tagi, 11.11.21",null,null,null,null,null,null,null,null,null,null,null,null,"Tagi, 12.11.21"]
[null,161,null,null,null,null,null,null,null,null,null,null,1,null,162,null,null,null,null,null,null,null,null,null,null,0,null,163,null,null,null,null,null,null,"w",null,null,null,4,null,164,null,null,null,null,null,null,null,"k",null,null,2,null,165,null,null,null,null,null,null,null,null,null,null,1,null,166,null,null,null,null,null,null,null,null,null,null,1,null,167,null,null,null,null,null,null,null,null,null,null,1,null,168,null,null,null,null,null,null,null,null,"u",null,1]
[null,"Tagi, 05.11.21",null,null,null,null,null,null,null,null,null,null,1,null,"Beobachter, 05.11.21",null,null,null,null,null,null,null,null,null,null,0,null,"Tagi, 06.11.21",null,null,null,null,null,null,null,null,null,null,1,null,"Tagi, 08.11.21",null,null,null,null,null,null,null,null,null,null,0,null,"Tagi, 09.11.21",null,null,null,null,null,null,null,null,null,null,3,null,"Tagi, 10.11.21",null,null,null,"w",null,null,null,null,null,null,6,null,"Tagi, 11.11.21",null,null,null,null,null,null,null,null,null,null,2,null,"Tagi, 12.11.21",null,null,null,null,"k",null,null,null,null,null,3]
[null,null,null,null,null,null,null,null,null,null,null,null,2,null,null,null,null,null,null,"w",null,null,null,null,"l",4,null,null,null,null,null,null,null,null,null,null,null,null,1,null,null,null,null,null,null,null,null,null,null,null,null,2,null,null,null,null,"u",null,null,null,"o",null,null,null,2,null,null,null,null,null,null,null,null,null,null,null,null,1,null,null,null,null,null,null,null,null,null,null,"l",null,4,null,null,"w",null,null,null,null,null,null,null,null,null,1]
[null,null,"r",null,null,null,null,null,null,null,null,null,3,null,null,null,null,null,null,null,null,null,null,null,null,1,null,null,null,null,null,null,null,null,null,null,null,null,0,null,null,null,"o",null,null,null,null,null,null,null,null,1,null,null,null,null,null,null,null,null,null,null,null,null,1,null,null,null,"o",null,null,null,null,"w",null,null,null,3,null,null,null,null,null,null,null,null,null,null,null,null,0,null,null,null,null,null,null,null,null,null,null,null,null,4]
[null,null,null,null,null,null,null,null,null,null,null,null,1,null,null,null,null,null,null,null,null,null,null,null,null,1,null,null,null,null,null,null,null,null,null,null,null,null,7,null,null,null,null,null,null,null,null,null,null,null,null,2,null,null,null,null,null,null,null,null,null,null,null,null,0,null,null,null,null,null,null,null,null,null,null,null,null,3,null,null,null,null,null,null,null,null,null,null,null,null,2,null,null,null,null,null,null,"q",null,null,null,null,null,2]
[null,null,null,null,null,null,null,null,null,"r",null,null,5,null,null,null,null,null,null,null,null,null,null,null,null,5,null,null,null,null,null,null,null,null,null,null,null,null,1,null,null,null,null,null,null,null,null,null,null,null,null,0,null,null,null,null,null,null,null,null,null,null,null,null,4,null,null,null,null,null,null,null,null,null,null,null,null,2,null,null,null,null,null,null,null,null,null,null,null,null,5,null,null,null,null,null,null,null,null,null,null,null,null,2]
[null,null,null,null,null,null,null,null,null,null,null,null,0,null,null,null,null,null,null,null,null,null,null,null,null,0,null,null,null,null,null,null,null,null,null,null,null,null,2,null,null,null,null,null,null,null,"l",null,null,null,null,4,null,null,null,null,null,null,null,null,null,null,null,null,0,null,null,null,null,null,null,null,null,null,null,null,null,0,null,null,null,null,null,null,null,null,null,null,null,null,1,null,null,null,null,null,null,null,null,null,null,null,null,0]
[null,null,null,"u",null,null,null,null,null,null,null,null,2,null,null,null,null,null,null,null,null,null,null,null,null,1,null,null,null,null,null,null,null,null,null,null,"k",null,1,null,null,"w",null,null,null,null,null,null,null,null,null,2,null,null,null,"w",null,null,null,null,null,null,null,null,5,null,null,"k",null,null,null,null,null,null,null,null,null,3,null,null,null,null,null,null,null,null,"u",null,null,null,2,null,null,null,null,null,null,null,null,null,null,null,null,1]
[null,null,null,null,null,null,null,null,null,null,null,null,1,null,null,null,null,null,null,null,null,null,null,null,null,6,null,null,null,null,null,null,null,"k",null,null,null,null,1,null,null,null,null,null,null,null,null,null,null,null,null,2,null,null,null,null,null,null,null,null,null,null,null,null,0,null,null,null,null,null,null,null,null,null,null,null,null,0,null,null,null,null,null,null,null,null,null,null,null,null,2,null,null,null,null,null,null,null,null,null,null,null,null,2]
[null,null,null,null,null,null,null,null,"l",null,null,null,4,null,null,null,null,null,null,null,null,null,null,null,null,2,null,null,null,null,null,null,null,null,null,null,"r",null,2,null,null,null,null,null,null,null,null,null,null,null,null,5,null,null,null,null,null,null,"l",null,null,null,null,null,4,null,null,null,null,null,null,null,null,null,null,null,null,1,null,null,null,null,null,null,null,null,null,null,null,null,1,null,null,null,null,null,null,null,null,null,null,null,null,4]
[null,{"$f":"SUM(C512:L512)","v":20},1,3,1,0,5,3,1,3,1,2,{"$f":"SUM(M502:M511)","v":20},null,{"$f":"SUM(P512:Y512)","v":20},0,0,5,0,5,0,3,2,3,2,{"$f":"SUM(Z502:Z511)","v":20},null,{"$f":"SUM(AC512:AL512)","v":20},2,1,0,2,0,6,1,2,4,2,{"$f":"SUM(AM502:AM511)","v":20},null,{"$f":"SUM(AP512:AY512)","v":20},1,2,2,2,4,1,0,3,1,4,{"$f":"SUM(AZ502:AZ511)","v":20},null,{"$f":"SUM(BC512:BL512)","v":20},1,2,6,3,1,0,2,1,1,3,{"$f":"SUM(BM502:BM511)","v":20},null,{"$f":"SUM(BP512:BY512)","v":20},1,4,0,4,1,1,4,1,0,4,{"$f":"SUM(BZ502:BZ511)","v":20},null,{"$f":"SUM(CC512:CL512)","v":20},1,4,0,3,0,0,7,1,3,1,{"$f":"SUM(CM502:CM511)","v":20},null,{"$f":"SUM(CP512:CY512)","v":20},4,1,0,2,4,1,4,1,2,1,{"$f":"SUM(CZ502:CZ511)","v":20}]
[null,null,"Lösung",null,null,null,null,null,null,null,null,null,null,null,null,"Lösung",null,null,null,null,null,null,null,null,null,null,null,null,"Lösung",null,null,null,null,null,null,null,null,null,null,null,null,"Lösung",null,null,null,null,null,null,null,null,null,null,null,null,"Lösung",null,null,null,null,null,null,null,null,null,null,null,null,"Lösung",null,null,null,null,null,null,null,null,null,null,null,null,"Lösung",null,null,null,null,null,null,null,null,null,null,null,null,"Lösung"]
[null,161,"w","w","w","w","w","x","w","w","w","w",1,null,162,"w","w","w","w","w","w","w","w","w","w",0,null,163,"w","w","w","w","w","x","w","x","x","x",4,null,164,"w","w","w","w","x","w","w","k","w","w",2,null,165,"w","w","x","w","w","w","w","w","w","w",1,null,166,"w","w","w","w","w","w","w","w","w","x",1,null,167,"w","w","w","w","w","w","x","w","w","w",1,null,168,"w","w","w","w","w","w","w","w","u","w",1]
[null,"Tagi, 05.11.21","w","w","w","w","w","w","w","x","w","w",1,null,"Beobachter, 05.11.21","w","w","w","w","w","w","w","w","w","w",0,null,"Tagi, 06.11.21","w","w","w","w","w","x","w","w","w","w",1,null,"Tagi, 08.11.21","w","w","w","w","w","w","w","w","w","w",0,null,"Tagi, 09.11.21","x","w","w","w","w","w","u","w","w","x",3,null,"Tagi, 10.11.21","w","x","w","w","x","x","x","x","w","x",6,null,"Tagi, 11.11.21","x","w","w","x","w","w","w","w","w","w",2,null,"Tagi, 12.11.21","w","w","w","w","k","w","x","w","o","w",3]
[null,null,"w","w","w","w",4,"w","w","x","w","w",2,null,null,"w","w","x","w","w","w","x","w","x","l",4,null,null,"w","w","w","w","w","x","w","w","w","w",1,null,null,"w","u","w","w","x","w","w","w","w","w",2,null,null,"w","w","u","w","w","w","o","w","w","w",2,null,null,"w","x","w","w","w","w","w","w","w","w",1,null,null,"w","w","w","x","w","w","x","x","l","w",4,null,null,"w","w","w","w","w","w","x","w","w","w",1]
[null,null,"r","x","w","w",4,"w","w","w","w","w",3,null,null,"w","w","w","w","x","w","w","w","w","w",1,null,null,"w","w","w","w","w","w","w","w","w","w",0,null,null,"w","o","w","w","w","w","w","w","w","w",1,null,null,"w","w","x","w","w","w","w","w","w","w",1,null,null,"w","o","w",3,"w","w","w","w","w","x",3,null,null,"w","w","w","w","w","w","w","w","w","w",0,null,null,2,2,"w","w","x","w","x","w","w","w",4]
[null,null,"w","w","w","w","x","w","w","w","w","w",1,null,null,"w","w",2,"w","w","w","w","w","w","w",1,null,null,"x","x","w","x","w","x",4,4,4,"w",7,null,null,"w","w","w","w","w","w","w","w","x","x",2,null,null,"w","w","w","w","w","w","w","w","w","w",0,null,null,"w","w","w",3,"w","w",2,"w","w","x",3,null,null,"w",4,"w","w","w","w","x","w","w","w",2,null,null,"w","w","w","w","q","w","x","w","w","w",2]
[null,null,"w","w","x","w","x","w","w","r","x","x",5,null,null,"w","w",2,"w","x","w","x","x","x","w",5,null,null,"w","w","w","x","w","w","w","w","w","w",1,null,null,"w","w","w","w","w","w","w","w","w","w",0,null,null,"w","x","x","x","w","w","w","w","w","x",4,null,null,"w","w","w",3,"w","w",2,"w","w","w",2,null,null,"w",4,"w","x","w","w","x","w","x","x",5,null,null,"w","w","w","w","x","w","w","w","w","x",2]
[null,null,"w","w","w","w","w","w","w","w","w","w",0,null,null,"w","w","w","w","w","w","w","w","w","w",0,null,null,"x","w","w","w","w","x","w","w","w","w",2,null,null,"w","w","x","x","x","x","w","w","w","w",4,null,null,"w","w","w","w","w","w","w","w","w","w",0,null,null,"w","w","w","w","w","w","w","w","w","w",0,null,null,"w",4,"w","w","w","w","w","w","w","w",1,null,null,"w","w","w","w","w","w","w","w","w","w",0]
[null,null,"w","u","w","w","w","x","w","w","w","w",2,null,null,"w","w","w","w","x","w","w","w","w","w",1,null,null,"w","w","w","w","w","w","w","w","k","w",1,null,null,"w","w","w","w","w","w","w","x","w","x",2,null,null,"w","w","x","x","w","w","w",3,3,3,5,null,null,"k","w","w","x","w","w","x","w","w","w",3,null,null,"w",4,"w","w","w","w","u","w","w","w",2,null,null,3,"w","w","w","w","w","w","w","w","w",1]
[null,null,"w","x","w","w","w","w","w","w","w","w",1,null,null,"w","w","x","w","x","w","x","x","x","x",6,null,null,"w","w","w","w","w","k","w","w","w","w",1,null,null,"w","w","w","w","w","w","w",2,"w","x",2,null,null,"w","w","w","w","w","w","w","w","w","w",0,null,null,"w","w","w","w","w","w","w","w","w","w",0,null,null,"w","w","w","w","w","w","x","w","x","w",2,null,null,3,"w","w","x","w","w","w","w","w","w",2]
[null,null,"w","w","w","w","x","x","l","w","w","x",4,null,null,"w","w","x","w","x","w","w","w","w","w",2,null,null,"w","w","w","w","w","w","w","w","r","l",2,null,null,"x","w",3,3,3,"w","w","w","w","x",5,null,null,"w","x","x","x","l","w","w","w","w","w",4,null,null,"w","x","w","w","w","w","w","w","w","w",1,null,null,"w","w","w","w","w","w","x","w","w","w",1,null,null,3,"w","w","x","w","x","w","x","w","w",4]
[null,{"$f":"SUM(C524:L524)","v":20},1,3,1,0,5,3,1,3,1,2,{"$f":"SUM(M514:M523)","v":20},null,{"$f":"SUM(P524:Y524)","v":20},0,0,5,0,5,0,3,2,3,2,{"$f":"SUM(Z514:Z523)","v":20},null,{"$f":"SUM(AC524:AL524)","v":20},2,1,0,2,0,6,1,2,4,2,{"$f":"SUM(AM514:AM523)","v":20},null,{"$f":"SUM(AP524:AY524)","v":20},1,2,2,2,4,1,0,3,1,4,{"$f":"SUM(AZ514:AZ523)","v":20},null,{"$f":"SUM(BC524:BL524)","v":20},1,2,6,3,1,0,2,1,1,3,{"$f":"SUM(BM514:BM523)","v":20},null,{"$f":"SUM(BP524:BY524)","v":20},1,4,0,4,1,1,4,1,0,4,{"$f":"SUM(BZ514:BZ523)","v":20},null,{"$f":"SUM(CC524:CL524)","v":20},1,4,0,3,0,0,7,1,3,1,{"$f":"SUM(CM514:CM523)","v":20},null,{"$f":"SUM(CP524:CY524)","v":20},4,1,0,2,4,1,4,1,2,1,{"$f":"SUM(CZ514:CZ523)","v":20}]
[]
[null,null,"Tagi, 13.11.21",null,null,null,null,null,null,null,null,null,null,null,null,"Tagi, 15.11.21",null,null,null,null,null,null,null,null,null,null,null,null,"Migros-Magazin, 15.11.21",null,null,null,null,null,null,null,null,null,null,null,null,"Tagi, 16.11.21",null,null,null,null,null,null,null,null,null,null,null,null,"Tagi, 17.11.21",null,null,null,null,null,null,null,null,null,null,null,null,"Tagi, 18.11.21",null,null,null,null,null,null,null,null,null,null,null,null,"Tagi, 19.11.21",null,null,null,null,null,null,null,null,null,null,null,null,"Tagi, 20.11.21"]
[null,169,null,null,null,"l",null,null,null,null,null,null,2,null,170,null,null,null,null,null,null,null,null,null,null,2,null,171,null,null,null,null,null,null,null,null,null,null,1,null,172,null,null,null,null,null,null,null,null,null,null,3,null,173,null,"r",null,null,null,null,null,null,null,null,3,null,174,null,null,null,null,null,null,null,null,null,null,4,null,175,null,null,null,null,null,null,null,null,null,null,2,null,176,null,null,null,null,null,null,null,null,null,null,1]
[null,"Tagi, 13.11.21",null,null,null,null,null,null,null,null,null,null,0,null,"Tagi, 15.11.21",null,null,null,null,null,null,null,null,null,null,2,null,"Migros-Magazin, 15.11.21",null,null,null,null,null,null,"u",null,null,null,1,null,"Tagi, 16.11.21",null,null,null,null,null,null,null,null,null,null,0,null,"Tagi, 17.11.21",null,null,null,null,null,null,null,null,null,null,1,null,"Tagi, 18.11.21",null,null,null,null,"q",null,null,null,null,null,2,null,"Tagi, 19.11.21",null,null,null,null,null,null,null,"r",null,null,2,null,"Tagi, 20.11.21",null,null,null,null,null,null,null,null,null,null,0]
[null,null,null,null,"w",null,null,null,"w",null,null,null,3,null,null,null,null,null,null,null,null,null,null,null,null,2,null,null,null,null,null,null,null,null,null,null,null,null,2,null,null,null,null,null,null,null,null,null,null,null,null,0,null,null,null,null,null,null,null,null,null,null,null,null,2,null,null,null,null,null,null,null,null,null,null,null,null,6,null,null,null,null,null,null,null,null,null,null,null,null,0,null,null,null,null,null,null,null,null,null,null,null,null,1]
[null,null,null,null,null,null,null,null,null,null,null,null,2,null,null,null,null,null,"o",null,null,null,null,null,null,2,null,null,null,null,null,null,null,null,null,null,null,null,6,null,null,null,null,null,null,null,null,null,null,null,null,4,null,null,null,null,null,null,null,null,null,null,null,null,1,null,null,null,null,null,null,null,null,null,null,null,null,0,null,null,null,null,null,null,null,null,null,null,null,null,5,null,null,null,null,null,null,null,null,null,null,null,null,6]
[null,null,null,null,null,null,null,"k",null,null,null,null,3,null,null,null,null,null,null,null,null,null,null,"k",null,4,null,null,null,null,null,null,null,null,null,null,null,null,1,null,null,null,null,null,null,null,null,null,null,null,null,0,null,null,null,null,null,null,null,null,null,null,null,null,1,null,null,null,null,null,null,null,null,null,null,null,null,2,null,null,"o",null,null,null,null,null,null,null,null,null,2,null,null,null,null,null,null,null,null,null,null,"o",null,2]
[null,null,null,null,null,null,null,null,null,null,null,null,0,null,null,null,null,null,null,null,null,null,null,null,null,0,null,null,"o",null,null,null,null,null,null,null,"w",null,2,null,null,null,"q",null,null,null,null,null,null,null,null,3,null,null,null,null,null,null,null,null,null,null,null,null,5,null,null,null,null,null,null,null,null,null,null,null,null,0,null,null,null,null,null,null,null,null,null,null,null,null,3,null,null,null,null,null,null,null,null,null,null,null,null,2]
[null,null,null,null,null,null,null,null,null,null,null,null,2,null,null,null,null,null,null,null,null,null,null,null,null,1,null,null,null,null,null,null,null,null,null,null,null,null,1,null,null,null,null,null,null,null,null,null,null,null,null,2,null,null,null,null,null,null,null,null,null,"q",null,null,3,null,null,"w",null,null,null,null,"w",null,null,null,null,2,null,null,null,null,null,null,"o",null,null,null,null,null,1,null,null,null,null,null,null,null,null,null,null,null,null,1]
[null,null,null,null,null,null,null,null,null,null,null,null,3,null,null,null,"u",null,null,null,null,null,null,null,null,2,null,null,null,null,null,null,null,null,null,null,null,null,0,null,null,null,null,null,null,"o",null,null,null,null,null,2,null,null,null,null,null,"k",null,null,null,null,null,null,2,null,null,null,null,null,null,null,null,null,null,null,null,1,null,null,null,null,null,null,null,null,null,null,null,null,0,null,null,null,null,null,null,null,null,"r",null,null,null,4]
[null,null,null,null,null,null,null,null,null,null,null,null,1,null,null,null,null,null,null,null,"q",null,null,null,null,3,null,null,null,null,null,null,null,null,null,null,null,null,4,null,null,null,"w",null,null,null,null,null,"o",null,null,2,null,null,null,null,null,null,null,null,null,null,null,null,0,null,null,null,null,null,null,null,null,null,null,null,null,1,null,null,null,null,null,null,null,null,"l",null,null,null,4,null,null,null,null,null,null,null,null,null,null,null,null,1]
[null,null,null,null,null,null,null,null,null,null,null,null,4,null,null,null,null,null,null,null,null,null,null,null,null,2,null,null,null,null,null,null,null,null,null,null,null,null,2,null,null,null,null,null,null,null,null,null,null,null,null,4,null,null,null,null,null,"k",null,null,null,null,null,null,2,null,null,null,null,null,null,"k",null,null,null,null,null,2,null,null,null,null,null,null,null,null,null,null,null,null,1,null,null,null,null,null,null,null,null,null,null,"r",null,2]
[null,{"$f":"SUM(C537:L537)","v":20},1,0,4,2,1,1,4,3,2,2,{"$f":"SUM(M527:M536)","v":20},null,{"$f":"SUM(P537:Y537)","v":20},2,3,1,3,0,5,2,0,1,3,{"$f":"SUM(Z527:Z536)","v":20},null,{"$f":"SUM(AC537:AL537)","v":20},5,1,0,3,1,0,4,1,4,1,{"$f":"SUM(AM527:AM536)","v":20},null,{"$f":"SUM(AP537:AY537)","v":20},3,3,1,1,2,2,2,4,1,1,{"$f":"SUM(AZ527:AZ536)","v":20},null,{"$f":"SUM(BC537:BL537)","v":20},4,1,1,3,1,0,3,3,2,2,{"$f":"SUM(BM527:BM536)","v":20},null,{"$f":"SUM(BP537:BY537)","v":20},6,0,0,2,4,1,2,3,1,1,{"$f":"SUM(BZ527:BZ536)","v":20},null,{"$f":"SUM(CC537:CL537)","v":20},2,1,0,2,5,2,1,4,1,2,{"$f":"SUM(CM527:CM536)","v":20},null,{"$f":"SUM(CP537:CY537)","v":20},1,0,2,0,5,1,3,1,4,3,{"$f":"SUM(CZ527:CZ536)","v":20}]
[null,null,"Lösung",null,null,null,null,null,null,null,null,null,null,null,null,"Lösung",null,null,null,null,null,null,null,null,null,null,null,null,"Lösung",null,null,null,null,null,null,null,null,null,null,null,null,"Lösung",null,null,null,null,null,null,null,null,null,null,null,null,"Lösung",null,null,null,null,null,null,null,null,null,null,null,null,"Lösung",null,null,null,null,null,null,null,null,null,null,null,null,"Lösung",null,null,null,null,null,null,null,null,null,null,null,null,"Lösung"]
[null,169,"w","w","r","l","w","w","w","w","w","w",2,null,170,"w","w","x","w","w","w","w","w","w",3,2,null,171,"w","w","w","w","w","w","w","w","x","w",1,null,172,"x","x","w","w","w","w","x","w","w","w",3,null,173,"w","r","x","w","w","w",3,"w","w","w",3,null,174,"x","w","w","w","x","w","x","x","w","w",4,null,175,"w","x","w","w","x","w","w","w","w","w",2,null,176,"w","w","w","w","w","w","w","w","w","x",1]
[null,"Tagi, 13.11.21","w","w","w","w","w","w","w","w","w","w",0,null,"Tagi, 15.11.21","w","w","w","w","w","w","x","w","w",3,2,null,"Migros-Magazin, 15.11.21","w","w","w","w","w","w","u","w","w","w",1,null,"Tagi, 16.11.21","w","w","w","w","w","w","w","w","w","w",0,null,"Tagi, 17.11.21","w","w","w","w","w","w",3,"w","w","w",1,null,"Tagi, 18.11.21","x","w","w","w","q","w","w","w","w","w",2,null,"Tagi, 19.11.21","w","w","w","w","w","w","w","r","l","w",2,null,"Tagi, 20.11.21","w","w","w","w","w","w","w","w","w","w",0]
[null,null,"x","w","w","w","w","w","w","x","w","x",3,null,null,"w","w","w","x","w","w","w","w","w",3,2,null,null,"x","w","w","w","w","w","x","w","w","w",2,null,null,"w","w","w","w","w","w","w","w","w","w",0,null,null,"w","w","w","w","w","w",3,"w","x","w",2,null,null,"x","w","w","w","x","w","x","x","x","x",6,null,null,"w","w","w","w","w","w","w","w","w","w",0,null,null,"w","w","w","w","w","w","w","w","x","w",1]
[null,null,"w","w","w","w","w","w","w","x","w",2,2,null,null,"x","w","w","o","w","w","w","w","w","w",2,null,null,"x","w","w","x","x","w","x","w","x","x",6,null,null,"w","w","w","w","w","x","x","x","x","w",4,null,null,4,"w","w","w","w","w","w","w","w","w",1,null,null,"w","w","w","w","w","w","w","w","w","w",0,null,null,"u","w","w",3,3,3,"w","x","w","w",5,null,null,"x","w","x","w","x","x","x","w","x","w",6]
[null,null,"w","w","x","w","w","k","w","x","w","w",3,null,null,"x","w","w","w","w","x","x","w","k","w",4,null,null,"x","w","w","w","w","w","w","w","w","w",1,null,null,"w","w","w","w","w","w","w","w","w","w",0,null,null,4,"w","w","w","w","w","w","w","w","w",1,null,null,"x","w","w","w","w","x","w","w","w","w",2,null,null,"o","w","w","w","w","w","w","x","w","w",2,null,null,"w","w","x","w","w","w","w","w","o","w",2]
[null,null,"w","w","w","w","w","w","w","w","w","w",0,null,null,"w","w","w","w","w","w","w","w","w","w",0,null,null,"o","w","w","x","w","w","w","w","w","w",2,null,null,"x","q","x","w","w","w","w","w","w","w",3,null,null,4,"w","w","x","x","w","w",3,"w","x",5,null,null,"w","w","w","w","w","w","w","w","w","w",0,null,null,"w","w","w","w","x","w","w","x","w","x",3,null,null,"w","w","w","w",4,"w","x","w","w","w",2]
[null,null,"w","w","w","w","w","w","x","w","x","w",2,null,null,"w","w","w","w","w",4,"w","w","w","w",1,null,null,"w","w","w","w","w","w","w","w","x","w",1,null,null,"w","w","w","w","u","w","w","x","w","w",2,null,null,"x","w","w","w","w","w","w",3,"w","x",3,null,null,"w","w","w",2,"w","w","w","x","w","w",2,null,null,"w","w","w","w","o","w","w","w","w","w",1,null,null,"w","w","w","w",4,"w","w","w","w","w",1]
[null,null,"w","w","x","w","w","w","x","w","x","w",3,null,null,"w",3,"w","w","w",4,"w","w","w","w",2,null,null,"w","w","w","w","w","w","w","w","w","w",0,null,null,"w","w","w","w","o","w","w","x","w","w",2,null,null,"w","w","w","k","w","w","w",3,"w","w",2,null,null,"w","w","w",2,"w","w","w","w","w","w",1,null,null,"w","w","w","w","w","w","w","w","w","w",0,null,null,"w","w","w","w",4,"w","r","x","w","x",4]
[null,null,"w","w","w","w","w","w","x","w","w","w",1,null,null,"w",3,"w","x","w",4,"w","w","w","w",3,null,null,"w","w","w","x","w","w",3,3,3,"w",4,null,null,"w","w","w","w","w","w","w","o","w","x",2,null,null,"w","w","w","w","w","w","w","w","w","w",0,null,null,"x","w","w","w","w","w","w","w","w","w",1,null,null,"w","w","w",4,4,4,4,"w","w","w",4,null,null,"w","w","w","w",4,"w","w","w","w","w",1]
[null,null,"w","w",3,3,3,"w","x","w","w","w",4,null,null,"w",3,"w","w","w",4,"w","w","w","w",2,null,null,2,2,"w","w","w","w","w","w","w","w",2,null,null,"x","x","w","x","w","x","w","w","w","w",4,null,null,"w","w","w","k","w","w","w","w","x","w",2,null,null,"x","w","w","w","k","w","w","w","w","w",2,null,null,"w","w","w","w","w","w","w","w","w","x",1,null,null,"w","w","w","w","w","w","w","w","r","l",2]
[null,{"$f":"SUM(C549:L549)","v":20},1,0,4,2,1,1,4,3,2,2,{"$f":"SUM(M539:M548)","v":20},null,{"$f":"SUM(P549:Y549)","v":20},2,3,1,3,0,5,2,0,1,3,{"$f":"SUM(Z539:Z548)","v":20},null,{"$f":"SUM(AC549:AL549)","v":20},5,1,0,3,1,0,4,1,4,1,{"$f":"SUM(AM539:AM548)","v":20},null,{"$f":"SUM(AP549:AY549)","v":20},3,3,1,1,2,2,2,4,1,1,{"$f":"SUM(AZ539:AZ548)","v":20},null,{"$f":"SUM(BC549:BL549)","v":20},4,1,1,3,1,0,3,3,2,2,{"$f":"SUM(BM539:BM548)","v":20},null,{"$f":"SUM(BP549:BY549)","v":20},6,0,0,2,4,1,2,3,1,1,{"$f":"SUM(BZ539:BZ548)","v":20},null,{"$f":"SUM(CC549:CL549)","v":20},2,1,0,2,5,2,1,4,1,2,{"$f":"SUM(CM539:CM548)","v":20},null,{"$f":"SUM(CP549:CY549)","v":20},1,0,2,0,5,1,3,1,4,3,{"$f":"SUM(CZ539:CZ548)","v":20}]
[]
[null,null,"Tagi, 22.11.21",null,null,null,null,null,null,null,null,null,null,null,null,"Tagi, 23.11.21",null,null,null,null,null,null,null,null,null,null,null,null,"Tagi, 24.11.21",null,null,null,null,null,null,null,null,null,null,null,null,"Tagi, 25.11.21",null,null,null,null,null,null,null,null,null,null,null,null,"Tagi, 26.11.21",null,null,null,null,null,null,null,null,null,null,null,null,"Tagi, 27.11.21",null,null,null,null,null,null,null,null,null,null,null,null,"Tagi, 29.11.21",null,null,null,null,null,null,null,null,null,null,null,null,"Tagi, 30.11.21"]
[null,177,null,null,"l",null,null,null,null,null,null,null,5,null,178,null,null,"k",null,null,null,null,null,null,null,3,null,179,null,null,null,null,null,null,null,null,null,null,2,null,180,null,null,null,null,null,null,null,null,null,null,1,null,181,null,null,null,null,null,null,null,null,null,null,2,null,182,null,null,null,null,null,"q",null,null,null,null,7,null,183,null,null,null,null,null,null,null,null,null,null,2,null,184,null,null,null,null,null,null,null,null,null,null,1]
[null,"Tagi, 22.11.21",null,null,null,null,null,null,null,null,null,null,1,null,"Tagi, 23.11.21",null,null,null,null,null,null,null,null,null,null,2,null,"Tagi, 24.11.21",null,null,null,null,null,null,null,null,null,null,1,null,"Tagi, 25.11.21",null,null,null,null,null,null,null,null,null,null,4,null,"Tagi, 26.11.21",null,null,null,null,null,null,null,null,null,null,2,null,"Tagi, 27.11.21",null,null,null,null,null,null,null,null,null,null,1,null,"Tagi, 29.11.21","u",null,null,null,null,null,null,null,null,null,2,null,"Tagi, 30.11.21",null,null,null,null,null,null,null,null,"k",null,3]
[null,null,null,null,null,null,null,null,null,null,null,null,1,null,null,null,null,null,null,null,null,null,null,null,null,0,null,null,"u",null,null,"q",null,null,null,null,null,null,5,null,null,null,"l",null,null,null,null,null,"o",null,null,4,null,null,null,null,null,null,null,null,null,null,null,null,1,null,null,null,null,null,"r",null,null,null,null,null,null,4,null,null,null,null,null,null,null,"r",null,null,null,null,4,null,null,null,null,null,null,null,null,"u",null,null,null,1]
[null,null,null,null,null,null,null,null,null,null,null,null,1,null,null,null,null,null,null,null,null,null,"q",null,null,3,null,null,null,null,null,null,null,null,null,null,null,null,3,null,null,null,null,null,null,null,null,null,null,null,null,1,null,null,null,null,null,null,null,null,"k",null,null,null,3,null,null,null,null,null,null,null,null,null,null,null,null,2,null,null,null,null,null,null,null,null,null,null,null,null,2,null,null,null,null,null,null,null,null,null,null,null,null,4]
[null,null,null,null,null,null,null,null,null,null,null,null,1,null,null,null,null,null,null,null,null,null,null,null,null,0,null,null,null,null,null,null,null,null,null,null,null,null,1,null,null,null,null,null,null,null,null,null,null,null,null,2,null,null,null,null,null,null,null,null,null,null,null,null,2,null,null,null,null,null,null,null,null,null,null,null,null,0,null,null,null,null,null,null,null,null,null,null,null,null,0,null,null,null,null,null,null,null,null,null,null,null,null,2]
[null,null,null,null,null,null,null,null,null,null,null,null,3,null,null,"r",null,null,null,null,null,null,null,null,null,4,null,null,null,null,null,null,null,"k",null,null,null,null,3,null,null,null,null,null,null,null,null,null,null,null,null,0,null,null,"k",null,null,null,null,null,null,null,null,null,1,null,null,null,null,null,null,null,null,null,null,null,null,2,null,null,null,null,"k",null,null,null,"l",null,null,null,4,null,null,null,null,null,null,null,null,null,null,"u",null,5]
[null,null,null,null,null,null,null,null,null,"k",null,null,1,null,null,null,null,null,null,null,null,null,null,null,null,3,null,null,null,null,null,null,null,null,null,null,null,null,0,null,null,null,null,null,null,null,null,null,null,null,null,0,null,null,null,null,null,"r",null,null,null,null,null,null,3,null,null,null,null,null,null,null,null,null,"o",null,null,1,null,null,null,null,null,null,null,null,null,null,null,null,0,null,null,null,null,null,null,null,null,null,null,null,null,2]
[null,null,null,null,null,null,null,null,null,null,null,null,0,null,null,null,null,null,null,null,null,null,null,null,null,0,null,null,null,"u",null,null,null,null,null,null,null,null,2,null,null,null,null,null,null,null,null,null,null,null,null,1,null,null,null,null,null,null,null,null,null,"r",null,null,2,null,null,null,null,null,null,null,null,null,null,null,null,0,null,null,null,null,null,null,null,null,null,null,null,null,2,null,null,null,null,null,null,null,null,null,null,null,null,0]
[null,null,null,null,null,null,null,null,null,null,null,null,6,null,null,null,null,null,null,null,null,null,null,null,null,3,null,null,null,null,null,null,null,null,null,null,null,null,2,null,null,null,null,null,null,null,"q",null,null,null,null,3,null,null,null,null,null,null,null,null,null,null,null,null,3,null,null,null,"u",null,null,null,null,null,null,null,null,1,null,null,null,null,null,null,null,null,null,null,null,null,1,null,null,null,null,null,null,null,null,null,null,null,null,1]
[null,null,null,null,null,"o",null,null,null,null,null,null,1,null,null,null,null,null,null,null,null,null,null,"k",null,2,null,null,null,null,null,null,null,null,null,null,null,null,1,null,null,null,null,null,null,null,null,null,null,"r",null,4,null,null,null,null,null,null,null,null,null,null,null,null,1,null,null,null,null,null,null,null,null,null,null,null,null,2,null,null,null,null,null,null,null,null,null,null,null,null,3,null,null,null,null,null,null,null,null,null,null,"o",null,1]
[null,{"$f":"SUM(C562:L562)","v":20},1,5,1,2,1,3,0,3,2,2,{"$f":"SUM(M552:M561)","v":20},null,{"$f":"SUM(P562:Y562)","v":20},1,1,4,1,1,1,5,2,2,2,{"$f":"SUM(Z552:Z561)","v":20},null,{"$f":"SUM(AC562:AL562)","v":20},2,4,0,5,3,2,1,1,0,2,{"$f":"SUM(AM552:AM561)","v":20},null,{"$f":"SUM(AP562:AY562)","v":20},1,3,1,1,1,2,2,3,1,5,{"$f":"SUM(AZ552:AZ561)","v":20},null,{"$f":"SUM(BC562:BL562)","v":20},1,5,0,2,3,2,1,3,2,1,{"$f":"SUM(BM552:BM561)","v":20},null,{"$f":"SUM(BP562:BY562)","v":20},3,3,1,1,2,2,3,2,1,2,{"$f":"SUM(BZ552:BZ561)","v":20},null,{"$f":"SUM(CC562:CL562)","v":20},2,1,1,2,1,2,2,2,2,5,{"$f":"SUM(CM552:CM561)","v":20},null,{"$f":"SUM(CP562:CY562)","v":20},2,1,1,1,5,0,4,0,5,1,{"$f":"SUM(CZ552:CZ561)","v":20}]
[null,null,"Lösung",null,null,null,null,null,null,null,null,null,null,null,null,"Lösung",null,null,null,null,null,null,null,null,null,null,null,null,"Lösung",null,null,null,null,null,null,null,null,null,null,null,null,"Lösung",null,null,null,null,null,null,null,null,null,null,null,null,"Lösung",null,null,null,null,null,null,null,null,null,null,null,null,"Lösung",null,null,null,null,null,null,null,null,null,null,null,null,"Lösung",null,null,null,null,null,null,null,null,null,null,null,null,"Lösung"]
[null,177,"w","x","l","w","w","w","w",3,3,3,5,null,178,"w","w","k","w","w","w","x","w","w","x",3,null,179,"w","x","w","x","w","w","w","w","w","w",2,null,180,"w","w","w","w","w","w","w",3,"w","w",1,null,181,"w",4,"w","w","w","w","w","x","w","w",2,null,182,3,3,3,"w","x","q","x","w","w",2,7,null,183,"w","w","w","x","w","w","w","w","w",4,2,null,184,"w","w","w","w","w","w","x","w","w","w",1]
[null,"Tagi, 22.11.21","w","w","w","w","w","x","w","w","w","w",1,null,"Tagi, 23.11.21","w","w","w","w","w","w","x","w","w","x",2,null,"Tagi, 24.11.21","w","w","w","x","w","w","w","w","w","w",1,null,"Tagi, 25.11.21","w","w","w","x","w","x","w",3,"w",4,4,null,"Tagi, 26.11.21","w",4,"w","w","w","w","w","x","w","w",2,null,"Tagi, 27.11.21","w","w","w","w","w","w","w","w","w",2,1,null,"Tagi, 29.11.21","u","w","w","w","w","w","w","w","w",4,2,null,"Tagi, 30.11.21","w","w","w","x","x","w","w","w","k","w",3]
[null,null,"w",4,"w","w","w","w","w","w","w","w",1,null,null,"w","w","w","w","w","w","w","w","w","w",0,null,null,"u","w","w","x","w",3,3,3,"w","w",5,null,null,"x","l","w","w","w","w","w",3,"w",4,4,null,null,"w",4,"w","w","w","w","w","w","w","w",1,null,null,"w","w","w",4,4,4,4,"w","w","w",4,null,null,"o","w","w","w","w","r","x","w","w",4,4,null,null,"w","w","w","w","w","w","u","w","w","w",1]
[null,null,"w",4,"w","w","w","w","w","w","w","w",1,null,null,"w","w","w","w","w","w","x","q","x","w",3,null,null,"o","w","w","x","w","w","w","w","w","x",3,null,null,"w","w","w","w","w","w","w","w","w",4,1,null,null,"w",4,"w","w","x","w","k","w","w","w",3,null,null,"x","w","w","w","w","w","w","w","x","w",2,null,null,"w","w","w","x","w","w","w","w","w",4,2,null,null,"x","w","w","w","x","w",3,"w","w","x",4]
[null,null,"w",4,"w","w","w","w","w","w","w","w",1,null,null,"w","w","w","w","w","w","w","w","w","w",0,null,null,"w","w","w","w","w","w","w","w","w","x",1,null,null,"w","w","w","w","w","w","x","w","w",4,2,null,null,"w","w","w","w","w","w","w","w",2,2,2,null,null,"w","w","w","w","w","w","w","w","w","w",0,null,null,"w","w","w","w","w","w","w","w","w","w",0,null,null,"w","w","w","w","x","w",3,"w","w","w",2]
[null,null,"w",4,"w","w","x","x","w","w","w","w",3,null,null,"r","x","x","x","w","w","w","w","w","w",4,null,null,"w","x","w","x","w","k","w","w","w","w",3,null,null,"w","w","w","w","w","w","w","w","w","w",0,null,null,"k","w","w","w","w","w","w","w","w","w",1,null,null,"x","w","w","w","w","w","w","u","w","w",2,null,null,"w","w","k","w",3,3,3,"w","w","w",4,null,null,3,3,3,"w","x","w","w","w","u","w",5]
[null,null,"w","w","w","w","w","w","w","k","w","w",1,null,null,"w","w","w","w","w",3,3,3,"w","w",3,null,null,"w","w","w","w","w","w","w","w","w","w",0,null,null,"w","w","w","w","w","w","w","w","w","w",0,null,null,"w","w","w","r","x","x","w","w","w","w",3,null,null,"w","w","w","w","w","w","w","o","w","w",1,null,null,"w","w","w","w","w","w","w","w","w","w",0,null,null,"w","w","w","w","x","w","w","w","x","w",2]
[null,null,"w","w","w","w","w","w","w","w","w","w",0,null,null,"w","w","w","w","w","w","w","w","w","w",0,null,null,"w","u","w","w","x","w","w","w","w","w",2,null,null,"w","x","w","w","w","w","w","w","w","w",1,null,null,"w","w","w","w","w","w","w","r","l","w",2,null,null,"w","w","w","w","w","w","w","w","w","w",0,null,null,"w","w","w","w","w","w","w",2,2,"w",2,null,null,"w","w","w","w","w","w","w","w","w","w",0]
[null,null,"x","w","w","u","w","x","w","x","x","x",6,null,null,"w","w","x","w","x","w","x","w","w","w",3,null,null,"w","x","w","w","x","w","w","w","w","w",2,null,null,"w","w","w","w","x","q","x","w","w","w",3,null,null,"w","w","w",3,3,3,"w","w","w","w",3,null,null,"w","u","w","w","w","w","w","w","w","w",1,null,null,"w","x","w","w","w","w","w","w","w","w",1,null,null,"w","w","w","w","w","w","w","w","x","w",1]
[null,null,"w","w","w","o","w","w","w","w","w","w",1,null,null,"w","w","x","w","w","w","w","w","k","w",2,null,null,"w","w","w","w","x","w","w","w","w","w",1,null,null,"w","x","x","w","w","w","w","w","r","x",4,null,null,"w","x","w","w","w","w","w","w","w","w",1,null,null,"w","x","w","w","w","w","x","w","w","w",2,null,null,"w","w","w","w","w","w","w",3,3,3,3,null,null,"w","w","w","w","w","w","w","w","o","w",1]
[null,{"$f":"SUM(C574:L574)","v":20},1,5,1,2,1,3,0,3,2,2,{"$f":"SUM(M564:M573)","v":20},null,{"$f":"SUM(P574:Y574)","v":20},1,1,4,1,1,1,5,2,2,2,{"$f":"SUM(Z564:Z573)","v":20},null,{"$f":"SUM(AC574:AL574)","v":20},2,4,0,5,3,2,1,1,0,2,{"$f":"SUM(AM564:AM573)","v":20},null,{"$f":"SUM(AP574:AY574)","v":20},1,3,1,1,1,2,2,3,1,5,{"$f":"SUM(AZ564:AZ573)","v":20},null,{"$f":"SUM(BC574:BL574)","v":20},1,5,0,2,3,2,1,3,2,1,{"$f":"SUM(BM564:BM573)","v":20},null,{"$f":"SUM(BP574:BY574)","v":20},3,3,1,1,2,2,3,2,1,2,{"$f":"SUM(BZ564:BZ573)","v":20},null,{"$f":"SUM(CC574:CL574)","v":20},2,1,1,2,1,2,2,2,2,5,{"$f":"SUM(CM564:CM573)","v":20},null,{"$f":"SUM(CP574:CY574)","v":20},2,1,1,1,5,0,4,0,5,1,{"$f":"SUM(CZ564:CZ573)","v":20}]
[]
[null,null,"Migros-Magazin, 29.11.21",null,null,null,null,null,null,null,null,null,null,null,null,"Tagi, 01.12.21",null,null,null,null,null,null,null,null,null,null,null,null,"Tagi, 02.12.21",null,null,null,null,null,null,null,null,null,null,null,null,"Tagi, 03.12.21",null,null,null,null,null,null,null,null,null,null,null,null,"Tagi, 04.12.21",null,null,null,null,null,null,null,null,null,null,null,null,"Beobachter, 03.12.21",null,null,null,null,null,null,null,null,null,null,null,null,"Tagi, 06.12.21",null,null,null,null,null,null,null,null,null,null,null,null,"Tagi, 07.12.21"]
[null,185,null,null,null,null,null,null,null,"k",null,null,3,null,186,null,null,null,null,null,null,"w",null,null,null,1,null,187,null,null,null,null,null,null,null,null,null,null,4,null,188,null,null,null,null,null,null,"k",null,null,null,3,null,189,null,null,null,null,null,null,null,null,null,null,1,null,190,null,null,null,null,null,null,null,null,null,null,0,null,191,null,null,null,null,null,null,null,null,null,null,1,null,192,null,null,null,null,null,null,null,null,null,null,1]
[null,"Migros-Magazin, 29.11.21",null,null,null,"l",null,null,null,null,null,null,5,null,"Tagi, 01.12.21",null,"l",null,null,null,null,null,null,null,null,2,null,"Tagi, 02.12.21",null,null,null,null,null,null,null,null,null,null,0,null,"Tagi, 03.12.21",null,null,null,null,null,null,null,null,null,null,1,null,"Tagi, 04.12.21",null,null,null,null,null,null,null,null,null,null,3,null,"Beobachter, 03.12.21",null,null,null,null,null,null,null,null,null,null,0,null,"Tagi, 06.12.21",null,null,null,null,null,null,null,null,null,null,3,null,"Tagi, 07.12.21",null,"u",null,null,null,null,null,null,null,null,2]
[null,null,null,null,null,null,null,null,null,null,null,null,1,null,null,null,null,null,null,null,null,null,null,null,null,1,null,null,null,null,null,null,null,null,null,null,null,null,3,null,null,null,null,null,null,null,null,null,null,null,null,1,null,null,null,"q",null,null,null,null,null,null,null,null,3,null,null,null,null,null,null,null,null,null,null,null,null,4,null,null,null,null,null,null,null,null,null,null,null,null,1,null,null,null,null,null,null,"o",null,null,null,"q",null,5]
[null,null,null,null,null,null,null,null,null,null,null,null,2,null,null,null,null,null,null,null,null,null,null,null,null,4,null,null,null,null,null,null,null,null,null,null,"o",null,2,null,null,null,null,null,null,"q",null,null,null,null,null,2,null,null,null,null,null,null,null,null,null,null,null,null,0,null,null,null,null,null,null,null,null,null,null,null,null,1,null,null,null,null,null,"r",null,null,null,null,null,null,3,null,null,null,null,null,null,null,null,null,null,null,null,1]
[null,null,null,"u",null,null,null,null,null,null,null,null,3,null,null,null,null,null,null,null,null,null,null,null,null,3,null,null,null,null,null,null,null,null,null,null,null,null,1,null,null,"o",null,null,null,null,null,null,null,null,null,3,null,null,null,null,null,null,null,null,null,null,null,null,2,null,null,null,null,null,null,"o",null,null,null,null,null,4,null,null,null,null,null,null,null,null,null,null,null,null,0,null,null,null,null,null,null,null,null,null,null,null,null,2]
[null,null,null,null,null,null,null,null,null,null,null,null,3,null,null,null,null,null,null,null,null,null,null,null,null,2,null,null,null,null,null,null,null,null,null,null,null,null,1,null,null,null,null,null,null,null,null,null,null,null,null,0,null,null,null,null,"w",null,null,null,null,null,null,null,4,null,null,null,null,null,null,null,null,null,null,null,null,0,null,null,null,null,null,null,null,null,null,null,null,null,0,null,null,null,null,null,null,null,null,null,null,null,null,2]
[null,null,null,null,null,null,null,null,null,null,null,null,0,null,null,null,null,null,null,null,null,null,null,null,null,0,null,null,"o",null,null,null,null,null,null,null,null,null,3,null,null,null,null,null,null,null,null,null,null,null,null,3,null,null,null,null,null,null,null,null,null,null,null,null,1,null,null,null,null,null,null,null,null,null,null,null,null,1,null,null,null,null,null,null,null,null,null,null,null,null,2,null,null,null,null,null,null,null,null,null,null,null,null,1]
[null,null,null,null,null,null,null,null,null,null,null,null,2,null,null,"r",null,null,null,null,"l",null,null,null,null,6,null,null,null,null,null,null,null,null,null,null,null,null,1,null,null,null,null,null,null,null,null,null,null,null,null,1,null,null,null,null,"l",null,null,null,null,null,null,null,2,null,null,null,null,null,null,null,"k",null,null,null,null,5,null,null,null,null,null,null,null,null,null,null,null,null,3,null,null,null,null,null,null,null,null,null,null,null,null,2]
[null,null,null,null,null,null,null,null,null,null,null,null,0,null,null,null,null,null,null,null,null,null,null,null,null,0,null,null,null,null,null,null,null,"k",null,null,null,null,3,null,null,null,null,"l",null,null,null,null,null,null,null,5,null,null,null,null,null,null,null,null,null,null,null,null,0,null,null,null,null,null,null,null,null,null,null,null,null,1,null,null,null,null,null,null,null,null,null,null,null,null,2,null,null,null,null,null,null,"k",null,null,null,null,null,1]
[null,null,null,null,null,null,null,null,null,null,"k",null,1,null,null,null,null,null,null,null,null,null,null,null,null,1,null,null,null,null,null,null,null,null,null,null,null,null,2,null,null,null,null,null,null,null,null,null,null,null,null,1,null,null,null,null,null,null,null,null,"r",null,null,null,4,null,null,null,null,null,null,null,null,null,null,null,null,4,null,null,null,null,"l",null,null,null,"r",null,null,null,5,null,null,null,null,null,null,null,null,null,null,null,null,3]
[null,{"$f":"SUM(C587:L587)","v":20},1,3,1,1,4,2,2,1,2,3,{"$f":"SUM(M577:M586)","v":20},null,{"$f":"SUM(P587:Y587)","v":20},2,2,1,5,1,3,1,3,0,2,{"$f":"SUM(Z577:Z586)","v":20},null,{"$f":"SUM(AC587:AL587)","v":20},2,0,2,1,2,2,3,4,3,1,{"$f":"SUM(AM577:AM586)","v":20},null,{"$f":"SUM(AP587:AY587)","v":20},4,4,1,1,3,0,1,1,1,4,{"$f":"SUM(AZ577:AZ586)","v":20},null,{"$f":"SUM(BC587:BL587)","v":20},3,2,3,0,0,4,1,3,3,1,{"$f":"SUM(BM577:BM586)","v":20},null,{"$f":"SUM(BP587:BY587)","v":20},0,0,2,4,3,1,1,4,3,2,{"$f":"SUM(BZ577:BZ586)","v":20},null,{"$f":"SUM(CC587:CL587)","v":20},3,2,1,1,4,0,2,1,2,4,{"$f":"SUM(CM577:CM586)","v":20},null,{"$f":"SUM(CP587:CY587)","v":20},2,4,0,0,3,0,6,1,1,3,{"$f":"SUM(CZ577:CZ586)","v":20}]
[null,null,"Lösung",null,null,null,null,null,null,null,null,null,null,null,null,"Lösung",null,null,null,null,null,null,null,null,null,null,null,null,"Lösung",null,null,null,null,null,null,null,null,null,null,null,null,"Lösung",null,null,null,null,null,null,null,null,null,null,null,null,"Lösung",null,null,null,null,null,null,null,null,null,null,null,null,"Lösung",null,null,null,null,null,null,null,null,null,null,null,null,"Lösung",null,null,null,null,null,null,null,null,null,null,null,null,"Lösung"]
[null,185,"w","w","w","w","w","x","w","k","w","x",3,null,186,"w","w","w","x","w","w","w","w","w","w",1,null,187,"w","w","w",3,3,"x","w","w","x","w",4,null,188,"w","x","w","x","w","w","k","w","w","w",3,null,189,"x","w","w","w","w","w","w","w","w","w",1,null,190,"w","w","w","w","w","w","w","w","w","w",0,null,191,"x","w","w","w","w","w","w","w","w","w",1,null,192,"w","w","w","w","w","w","x","w","w","w",1]
[null,"Migros-Magazin, 29.11.21",4,4,4,4,"w","w","w","w","w",3,5,null,"Tagi, 01.12.21","r","l","w","w","w","w","w","w","w","w",2,null,"Tagi, 02.12.21","w","w","w","w","w","w","w","w","w","w",0,null,"Tagi, 03.12.21","w","x","w","w","w","w","w","w","w","w",1,null,"Tagi, 04.12.21","w","w","w","w","w","x","w","x","x","w",3,null,"Beobachter, 03.12.21","w","w","w","w","w","w","w","w","w","w",0,null,"Tagi, 06.12.21","x","w","w","w","w","w","x","w","x","w",3,null,"Tagi, 07.12.21","w","u","w","w","x","w","w","w","w","w",2]
[null,null,"w","w","w","w","w","w","w","w","w",3,1,null,null,"w","w","w","x","w","w","w","w","w","w",1,null,null,"w","w","w","w","x","w",3,"w","x","w",3,null,null,"w","w","w","w","x","w","w","w","w","w",1,null,null,"x","q","x","w","w","w","w","w","w","w",3,null,null,"w","w","x","w","x","w","w","x","x","w",4,null,null,"x","w","w","w","w","w","w","w","w","w",1,null,null,"w","x","w","w","o","w","w","x","q","x",5]
[null,null,"w","w","w","w","x","w","x","w","w","w",2,null,null,"w","w","w","x","w","x","w",3,"w","x",4,null,null,"w","w","w","w","w","w",3,"w","o","w",2,null,null,"x","w","w","w","q","w","w","w","w","w",2,null,null,"w","w","w","w","w","w","w","w","w","w",0,null,null,"w","w","w","w","x","w","w","w","w","w",1,null,null,"w","w","w","r","x","w","w","w","x","w",3,null,null,"w","x","w","w","w","w","w","w","w","w",1]
[null,null,"w","u","w","w","x","w",2,"w","w","w",3,null,null,"w","w","w","x","w","x","w",3,"w","w",3,null,null,"w","w","w","w","w","w",3,"w","w","w",1,null,null,"o","w","w","w","x","w","w","w","x","w",3,null,null,"w","w","x","w","w",3,"w","w","w","w",2,null,null,"w","w","x","w","o","w","w","x","x","w",4,null,null,"w","w","w","w","w","w","w","w","w","w",0,null,null,"w","w","w","w","w","w","x","w","w",2,2]
[null,null,"w","x","w","w","x","w","w","w","x","w",3,null,null,"w","w","w","x","w","w","w",3,"w","w",2,null,null,"u","w","w","w","w","w","w","w","w","w",1,null,null,"w","w","w","w","w","w","w","w","w","w",0,null,null,"x","w","w","w","w",3,"w","x","x","w",4,null,null,"w","w","w","w","w","w","w","w","w","w",0,null,null,"w","w","w","w","w","w","w","w","w","w",0,null,null,"w","w","w","w","w","w","x","w","w",2,2]
[null,null,"w","w","w","w","w","w","w","w","w","w",0,null,null,"w","w","w","w","w","w","w","w","w","w",0,null,null,"o","w","w","w","w","w","w","x","w","x",3,null,null,"x","x","w","w","w","w","w","w","w",4,3,null,null,"w","w","w","w","w",3,"w","w","w","w",1,null,null,"w","w","w","x","w","w","w","w","w","w",1,null,null,"w","w","w","w",3,"w","w","w","w",4,2,null,null,"w","w","w","w","w","w","x","w","w","w",1]
[null,null,"w","w","w","w","x","x","w","w","w","w",2,null,null,3,3,3,"w","x","l","w","w","w","x",6,null,null,"w","w","w","w","w","w","w","x","w","w",1,null,null,"w","w","w","w","w","w","w","w","w",4,1,null,null,"w","r","l","w","w","w","w","w","w","w",2,null,null,"w","w","w","x","w","k","w","x","x","x",5,null,null,"w","x","w","w",3,"w","w","w","w",4,3,null,null,"x","w","w","w","w","w","x","w","w","w",2]
[null,null,"w","w","w","w","w","w","w","w","w","w",0,null,null,"w","w","w","w","w","w","w","w","w","w",0,null,null,"w","w",2,"w","w","k","w","x","w","w",3,null,null,"x","x","l","w","w","w","w","x","w",4,5,null,null,"w","w","w","w","w","w","w","w","w","w",0,null,null,"w","w","w","x","w","w","w","w","w","w",1,null,null,"w","w","w","w",3,"w","w","w","w",4,2,null,null,"w","w","w","w","k","w","w","w","w","w",1]
[null,null,"w","w","w","w","w","w","w","w","k","w",1,null,null,"w","w","w","w","w","w","x","w","w","w",1,null,null,"w","w",2,"w","w","w","w","x","w","w",2,null,null,"w","w","w","w","w","w","w","w","w",4,1,null,null,"w","w","w","w","w","w",4,4,4,4,4,null,null,"w","w","w","x","w","w","x","x","w","x",4,null,null,"w","x","l","w","w","w","r","x","w",4,5,null,null,2,2,"w","w","w","w","x","w","w","w",3]
[null,{"$f":"SUM(C599:L599)","v":20},1,3,1,1,4,2,2,1,2,3,{"$f":"SUM(M589:M598)","v":20},null,{"$f":"SUM(P599:Y599)","v":20},2,2,1,5,1,3,1,3,0,2,{"$f":"SUM(Z589:Z598)","v":20},null,{"$f":"SUM(AC599:AL599)","v":20},2,0,2,1,2,2,3,4,3,1,{"$f":"SUM(AM589:AM598)","v":20},null,{"$f":"SUM(AP599:AY599)","v":20},4,4,1,1,3,0,1,1,1,4,{"$f":"SUM(AZ589:AZ598)","v":20},null,{"$f":"SUM(BC599:BL599)","v":20},3,2,3,0,0,4,1,3,3,1,{"$f":"SUM(BM589:BM598)","v":20},null,{"$f":"SUM(BP599:BY599)","v":20},0,0,2,4,3,1,1,4,3,2,{"$f":"SUM(BZ589:BZ598)","v":20},null,{"$f":"SUM(CC599:CL599)","v":20},3,2,1,1,4,0,2,1,2,4,{"$f":"SUM(CM589:CM598)","v":20},null,{"$f":"SUM(CP599:CY599)","v":20},2,4,0,0,3,0,6,1,1,3,{"$f":"SUM(CZ589:CZ598)","v":20}]
[]
[null,null,"Tagi, 08.12.21",null,null,null,null,null,null,null,null,null,null,null,null,"Tagi, 09.12.21",null,null,null,null,null,null,null,null,null,null,null,null,"Tagi, 11.12.21",null,null,null,null,null,null,null,null,null,null,null,null,"Tagi, 13.12.21",null,null,null,null,null,null,null,null,null,null,null,null,"Tagi, 14.12.21",null,null,null,null,null,null,null,null,null,null,null,null,"Migros-Magazin, 13.12.21",null,null,null,null,null,null,null,null,null,null,null,null,"Tagi, 15.12.21",null,null,null,null,null,null,null,null,null,null,null,null,"Tagi, 16.12.21"]
[null,193,null,null,null,null,null,null,null,null,null,null,2,null,194,"k",null,null,null,null,null,null,null,null,null,3,null,195,null,null,null,null,null,null,null,null,null,null,1,null,196,null,null,"u",null,null,null,"u",null,null,null,2,null,197,null,null,null,null,null,"r",null,null,null,null,3,null,198,null,null,null,null,null,null,null,null,"w",null,5,null,199,null,null,null,null,null,null,null,null,null,null,1,null,200,"k",null,null,null,null,null,null,null,null,null,1]
[null,"Tagi, 08.12.21",null,"u",null,null,null,null,null,null,null,null,1,null,"Tagi, 09.12.21",null,null,null,null,null,null,null,null,null,null,0,null,"Tagi, 11.12.21",null,null,null,null,null,"l",null,null,null,null,2,null,"Tagi, 13.12.21",null,null,null,null,null,null,null,null,null,null,5,null,"Tagi, 14.12.21",null,null,null,null,null,null,null,null,null,null,2,null,"Migros-Magazin, 13.12.21",null,null,null,null,"r",null,null,null,null,null,2,null,"Tagi, 15.12.21",null,null,null,null,null,null,null,null,null,null,2,null,"Tagi, 16.12.21",null,null,null,null,null,null,null,null,null,null,0]
[null,null,null,null,null,null,null,null,null,"u",null,null,2,null,null,null,null,null,null,null,null,null,null,null,null,0,null,null,null,null,null,null,null,null,null,"w",null,null,1,null,null,null,null,null,null,null,null,null,null,null,null,3,null,null,null,null,null,null,null,null,null,null,null,null,2,null,null,null,null,null,null,null,null,null,null,null,null,1,null,null,null,null,null,null,null,null,null,null,null,null,0,null,null,null,null,null,null,null,null,null,null,null,null,6]
[null,null,null,null,null,null,null,null,null,null,null,null,2,null,null,null,null,null,null,null,null,null,null,null,null,6,null,null,null,null,null,null,null,null,null,null,null,null,1,null,null,null,null,null,null,null,null,null,null,null,null,2,null,null,null,null,null,null,null,null,null,"k",null,null,3,null,null,null,null,null,null,null,null,null,null,null,null,2,null,null,null,null,null,null,null,null,null,null,null,null,1,null,null,null,null,null,null,null,null,null,null,null,null,0]
[null,null,null,null,null,null,null,null,null,null,null,null,3,null,null,null,null,null,null,null,null,null,null,null,null,1,null,null,null,null,null,null,"q",null,null,null,null,null,4,null,null,null,null,null,null,null,null,null,null,null,null,2,null,null,null,null,null,null,null,null,null,null,null,null,0,null,null,null,null,null,null,null,null,null,null,null,null,1,null,null,null,null,null,"u",null,null,null,null,null,null,2,null,null,null,null,null,"w",null,null,null,null,null,null,2]
[null,null,null,null,null,null,null,null,null,null,null,null,2,null,null,null,"o",null,null,null,null,null,null,null,null,2,null,null,null,null,null,null,null,null,null,null,null,null,1,null,null,null,null,null,null,null,null,null,null,null,null,0,null,null,null,null,null,null,null,null,null,null,null,null,0,null,null,null,null,null,null,null,null,null,null,null,null,2,null,null,null,null,null,null,null,null,null,null,null,null,3,null,null,null,null,null,null,null,null,null,null,null,null,2]
[null,null,null,null,null,null,null,null,null,null,null,null,3,null,null,null,null,null,null,null,"l",null,null,null,null,3,null,null,null,null,null,null,null,null,null,null,null,null,5,null,null,null,"q",null,null,null,null,null,null,null,null,4,null,null,null,null,null,null,null,null,null,null,null,null,4,null,null,null,null,null,null,null,null,null,null,null,null,0,null,null,null,null,null,null,null,"r",null,null,null,null,2,null,null,null,null,null,null,null,null,null,null,null,null,5]
[null,null,null,null,null,null,null,null,null,null,null,null,0,null,null,null,null,null,null,null,null,null,null,null,null,2,null,null,null,null,null,null,null,null,null,null,null,null,2,null,null,null,null,null,null,null,null,null,null,null,null,0,null,null,null,null,null,null,null,null,null,null,null,null,0,null,null,null,null,null,null,null,null,null,null,null,null,4,null,null,null,null,null,null,null,null,null,null,null,null,5,null,null,null,null,null,null,null,"q",null,null,null,null,1]
[null,null,null,null,null,null,null,null,null,null,null,null,0,null,null,null,null,null,null,null,"r",null,null,null,null,2,null,null,null,null,null,null,null,null,null,null,null,null,0,null,null,null,null,null,null,null,null,null,null,null,null,1,null,null,null,null,null,null,null,null,null,null,null,null,1,null,null,null,null,null,null,null,null,null,null,null,null,2,null,null,null,null,null,null,null,null,null,null,null,null,3,null,null,null,null,null,null,null,null,null,null,null,null,2]
[null,null,null,null,null,null,null,null,null,null,null,null,5,null,null,null,null,null,null,null,null,null,null,null,null,1,null,null,null,null,null,null,"l",null,null,null,null,null,3,null,null,null,null,null,null,null,null,null,null,"k",null,1,null,null,"o",null,"r",null,null,null,null,null,null,null,5,null,null,null,null,null,null,null,null,null,null,null,null,1,null,null,null,null,null,null,null,null,null,null,null,null,1,null,null,null,null,null,null,null,null,null,null,"o",null,1]
[null,{"$f":"SUM(C612:L612)","v":20},1,5,0,1,6,2,1,2,1,1,{"$f":"SUM(M602:M611)","v":20},null,{"$f":"SUM(P612:Y612)","v":20},2,4,1,1,3,4,2,2,0,1,{"$f":"SUM(Z602:Z611)","v":20},null,{"$f":"SUM(AC612:AL612)","v":20},1,0,2,2,5,1,3,3,2,1,{"$f":"SUM(AM602:AM611)","v":20},null,{"$f":"SUM(AP612:AY612)","v":20},3,2,6,0,0,0,4,0,4,1,{"$f":"SUM(AZ602:AZ611)","v":20},null,{"$f":"SUM(BC612:BL612)","v":20},2,2,1,2,4,2,1,1,0,5,{"$f":"SUM(BM602:BM611)","v":20},null,{"$f":"SUM(BP612:BY612)","v":20},1,2,2,5,2,1,0,1,3,3,{"$f":"SUM(BZ602:BZ611)","v":20},null,{"$f":"SUM(CC612:CL612)","v":20},2,1,2,3,0,2,3,1,1,5,{"$f":"SUM(CM602:CM611)","v":20},null,{"$f":"SUM(CP612:CY612)","v":20},5,0,2,2,0,3,1,1,3,3,{"$f":"SUM(CZ602:CZ611)","v":20}]
[null,null,"Lösung",null,null,null,null,null,null,null,null,null,null,null,null,"Lösung",null,null,null,null,null,null,null,null,null,null,null,null,"Lösung",null,null,null,null,null,null,null,null,null,null,null,null,"Lösung",null,null,null,null,null,null,null,null,null,null,null,null,"Lösung",null,null,null,null,null,null,null,null,null,null,null,null,"Lösung",null,null,null,null,null,null,null,null,null,null,null,null,"Lösung",null,null,null,null,null,null,null,null,null,null,null,null,"Lösung"]
[null,193,"w","w","w","w","x","x","w","w","w","w",2,null,194,"k","w","w","w","x","x","w","w","w","w",3,null,195,"w","w","w","w","w","w","w","x","w","w",1,null,196,"w","w","u","w","w","w","x","w","w","w",2,null,197,"w","w","w","w","w","r","x","w","w","x",3,null,198,"x","x","x","w","w","w","w","x","w","x",5,null,199,"w","w","w","w","w","w","x","w","w","w",1,null,200,"k","w","w","w","w","w","w","w","w","w",1]
[null,"Tagi, 08.12.21","w","u","w","w","w","w","w","w","w","w",1,null,"Tagi, 09.12.21","w","w","w","w","w","w","w","w","w","w",0,null,"Tagi, 11.12.21","w","w","w","w","r","l","w","w","w","w",2,null,"Tagi, 13.12.21","x","w","x","w","w","w","x","w","x","x",5,null,"Tagi, 14.12.21","w","x","w","w","w","w","w","w","w","x",2,null,"Migros-Magazin, 13.12.21","w","w","w","w","r","l","w","w","w","w",2,null,"Tagi, 15.12.21","w","w","w","w","w","w","w","w",2,2,2,null,"Tagi, 16.12.21","w","w","w","w","w","w","w","w","w","w",0]
[null,null,"w","x","w","w","w","w","w","u","w","w",2,null,null,"w","w","w","w","w","w","w","w","w","w",0,null,null,"w","w","x","w","w","w","w","w","w","w",1,null,null,"x","w","x","w","w","w","x","w","w","w",3,null,null,"w","w","w","w","x","w","w","w","w","x",2,null,null,"w","w","w","w","w","w","w","w",2,"w",1,null,null,"w","w","w","w","w","w","w","w","w","w",0,null,null,"x","w","w","x","w","w",4,4,4,4,6]
[null,null,"w","w","w","w","x","w","w","o","w","w",2,null,null,"w",3,"w","w",4,4,4,"x","w","x",6,null,null,"w","w","w","w","x","w","w","w","w","w",1,null,null,"w","w","w","w","w","w","x","w","x","w",2,null,null,"w","w","w","w","x","w","w","k","w","x",3,null,null,"w","w","w","x","w","w","w","w",2,"w",2,null,null,"w","w","w","w","w","w","w","w","w",3,1,null,null,"w","w","w","w","w","w","w","w","w","w",0]
[null,null,"w",3,"w","w","x","w","w","w","w","x",3,null,null,"w",3,"w","w","w","w","w","w","w","w",1,null,null,"w","w","w","w","q","w",3,3,3,"w",4,null,null,"w","x","x","w","w","w","w","w","w","w",2,null,null,"w","w","w","w","w","w","w","w","w","w",0,null,null,"w","w","w","x","w","w","w","w","w","w",1,null,null,"w","w","w","u","w","w","w","w","w",3,2,null,null,"x","w","x","w","w","w","w","w","w","w",2]
[null,null,"w",3,"w","w","x","w","w","w","w","w",2,null,null,"w",3,"w","w","w","w","w","x","w","w",2,null,null,"w","w","w","w","x","w","w","w","w","w",1,null,null,"w","w","w","w","w","w","w","w","w","w",0,null,null,"w","w","w","w","w","w","w","w","w","w",0,null,null,"w","w","w","x","w","w","w","w","w","x",2,null,null,"x","w","w","x","w","w","w","w","w",3,3,null,null,"x","w","w","w","w","w","w","w","w","x",2]
[null,null,"w",3,"w","w","x","w","x","w","w","w",3,null,null,"w","w","w",3,3,3,"w","w","w","w",3,null,null,"x","w","w","w","w","w",4,4,4,4,5,null,null,"x","q","x","w","w","w","w","w","x","w",4,null,null,"w","x","w","x","x","x","w","w","w","w",4,null,null,"w","w","w","w","w","w","w","w","w","w",0,null,null,"w","w","w","w","w","r","l","w","w","w",2,null,null,"x","w","x","x","w","x","w","w","w","x",5]
[null,null,"w","w","w","w","w","w","w","w","w","w",0,null,null,"x","x","w","w","w","w","w","w","w","w",2,null,null,"w","w","x","x","w","w","w","w","w","w",2,null,null,"w","w","w","w","w","w","w","w","w","w",0,null,null,"w","w","w","w","w","w","w","w","w","w",0,null,null,"w",4,4,4,4,"w","w","w","w","w",4,null,null,4,4,4,4,"w","w","w","w","w","x",5,null,null,"w","w","w","w","w","q","w","w","w","w",1]
[null,null,"w","w","w","w","w","w","w","w","w","w",0,null,null,"w","w","w","w","w","r","l","w","w","w",2,null,null,"w","w","w","w","w","w","w","w","w","w",0,null,null,"w","w","x","w","w","w","w","w","w","w",1,null,null,"u","w","w","w","w","w","w","w","w","w",1,null,null,"w","w","w","w","w","w","w","w","x","x",2,null,null,"w","w","w","w","w","x","x","x","w","w",3,null,null,"w","w","w","w","w","x","w","w","x","w",2]
[null,null,"x","w","w","x","x","x","w","w","x","w",5,null,null,"w","w","x","w","w","w","w","w","w","w",1,null,null,"w","w","w","x","l","w","x","w","w","w",3,null,null,"w","w","w","w","w","w","w","w","k","w",1,null,null,"o","w","r","x","x","w","w","w","w","x",5,null,null,"w","w","w","x","w","w","w","w","w","w",1,null,null,"w","w","x","w","w","w","w","w","w","w",1,null,null,"w","w","w","w","w","w","w","w","o","w",1]
[null,{"$f":"SUM(C624:L624)","v":20},1,5,0,1,6,2,1,2,1,1,{"$f":"SUM(M614:M623)","v":20},null,{"$f":"SUM(P624:Y624)","v":20},2,4,1,1,3,4,2,2,0,1,{"$f":"SUM(Z614:Z623)","v":20},null,{"$f":"SUM(AC624:AL624)","v":20},1,0,2,2,5,1,3,3,2,1,{"$f":"SUM(AM614:AM623)","v":20},null,{"$f":"SUM(AP624:AY624)","v":20},3,2,6,0,0,0,4,0,4,1,{"$f":"SUM(AZ614:AZ623)","v":20},null,{"$f":"SUM(BC624:BL624)","v":20},2,2,1,2,4,2,1,1,0,5,{"$f":"SUM(BM614:BM623)","v":20},null,{"$f":"SUM(BP624:BY624)","v":20},1,2,2,5,2,1,0,1,3,3,{"$f":"SUM(BZ614:BZ623)","v":20},null,{"$f":"SUM(CC624:CL624)","v":20},2,1,2,3,0,2,3,1,1,5,{"$f":"SUM(CM614:CM623)","v":20},null,{"$f":"SUM(CP624:CY624)","v":20},5,0,2,2,0,3,1,1,3,3,{"$f":"SUM(CZ614:CZ623)","v":20}]
[]
[null,null,"Tagi, 17.12.21",null,null,null,null,null,null,null,null,null,null,null,null,"Tagi, 18.12.21",null,null,null,null,null,null,null,null,null,null,null,null,"Tagi, 20.12.21",null,null,null,null,null,null,null,null,null,null,null,null,"Tagi, 21.12.21",null,null,null,null,null,null,null,null,null,null,null,null,"Migros-Magazin, 20.12.21",null,null,null,null,null,null,null,null,null,null,null,null,"Tagi, 23.12.21",null,null,null,null,null,null,null,null,null,null,null,null,"Tagi, 24.12.21",null,null,null,null,null,null,null,null,null,null,null,null,"Tagi, 27.12.21"]
[null,201,null,null,null,null,null,null,null,null,null,null,4,null,202,null,null,null,null,null,null,null,null,null,null,1,null,203,"w",null,null,null,null,null,null,null,null,null,3,null,204,null,null,null,null,null,null,null,null,null,null,1,null,205,null,null,null,null,"u",null,null,null,null,null,1,null,206,null,null,null,null,null,null,null,null,null,null,4,null,207,null,null,null,null,null,null,null,null,null,null,1,null,208,null,null,null,null,null,null,null,null,null,"u",1]
[null,"Tagi, 17.12.21",null,null,null,null,null,null,"k",null,null,null,1,null,"Tagi, 18.12.21",null,null,null,null,null,null,null,null,null,null,1,null,"Tagi, 20.12.21",null,null,null,null,null,null,"k",null,null,null,1,null,"Tagi, 21.12.21",null,null,null,null,null,"u",null,null,null,null,1,null,"Migros-Magazin, 20.12.21",null,null,null,null,null,null,null,null,null,null,3,null,"Tagi, 23.12.21",null,null,"k",null,null,null,null,null,null,null,1,null,"Tagi, 24.12.21",null,null,null,null,null,null,null,null,null,null,0,null,"Tagi, 27.12.21",null,null,null,null,null,null,null,null,null,null,5]
[null,null,null,null,null,null,null,null,null,null,null,null,1,null,null,null,null,null,null,null,null,null,null,null,null,3,null,null,null,null,null,null,null,null,null,null,null,null,1,null,null,null,null,null,null,null,null,null,null,null,null,3,null,null,null,"o",null,null,null,null,null,null,null,null,2,null,null,null,null,null,null,null,null,null,null,null,null,2,null,null,null,null,null,null,null,null,null,null,null,null,1,null,null,null,null,null,null,null,null,null,null,null,null,1]
[null,null,null,null,null,null,null,null,null,null,null,null,0,null,null,null,null,null,null,null,null,null,null,null,null,6,null,null,null,null,null,null,null,null,null,null,null,null,3,null,null,null,null,null,"w",null,null,null,null,null,null,1,null,null,null,null,null,null,null,null,null,null,null,null,2,null,null,null,null,null,null,"l",null,null,null,null,null,4,null,null,null,null,null,"l",null,null,null,null,"o",null,7,null,null,"q",null,null,null,null,null,null,null,null,null,1]
[null,null,"w",null,null,null,null,null,null,null,null,null,6,null,null,null,null,null,null,null,null,null,null,null,null,1,null,null,null,null,null,null,null,null,null,null,null,null,5,null,null,null,null,null,null,null,null,null,null,null,null,1,null,null,null,null,null,null,null,null,null,null,null,null,0,null,null,null,null,null,null,null,null,null,null,null,null,1,null,null,null,null,null,null,null,null,null,null,null,null,0,null,null,null,null,null,null,null,null,null,null,null,null,2]
[null,null,null,null,null,null,null,null,null,null,null,null,0,null,null,"u",null,null,null,null,null,null,null,null,null,1,null,null,null,null,null,null,null,null,null,null,null,null,0,null,null,null,null,null,null,null,null,null,null,null,null,5,null,null,null,null,null,null,null,null,null,null,null,null,4,null,null,null,null,null,null,null,null,null,null,null,null,2,null,null,null,null,null,null,null,null,null,null,null,null,3,null,null,null,null,null,null,null,null,null,null,null,null,4]
[null,null,null,null,"q",null,null,null,null,null,null,null,6,null,null,null,null,null,null,null,null,null,null,null,null,2,null,null,null,null,null,null,null,null,null,null,null,null,3,null,null,null,null,null,null,null,null,"k",null,null,null,2,null,null,null,null,null,null,null,null,null,null,null,null,2,null,null,null,null,null,null,null,null,null,null,null,null,0,null,null,null,null,"k",null,null,null,null,null,null,null,3,null,null,null,null,null,null,null,null,null,null,null,null,0]
[null,null,null,null,null,null,null,null,null,null,null,null,0,null,null,null,null,null,null,null,null,null,"k",null,null,2,null,null,null,null,null,null,null,null,"r",null,null,null,2,null,null,"k",null,null,null,null,null,null,null,null,null,1,null,null,null,"k",null,null,null,null,null,null,null,null,1,null,null,null,null,null,null,null,null,null,"l",null,null,3,null,null,null,null,null,null,null,null,null,null,null,null,2,null,null,null,null,null,null,null,null,null,null,null,null,1]
[null,null,null,null,null,null,null,null,null,null,null,null,1,null,null,null,"w",null,null,null,null,null,null,null,null,2,null,null,null,null,null,null,null,null,null,null,null,null,1,null,null,null,null,null,null,null,null,null,null,null,null,2,null,null,null,null,null,null,null,null,null,"q",null,null,4,null,null,"q",null,null,null,null,null,null,null,null,null,1,null,null,null,null,null,null,null,null,null,null,null,null,2,null,null,null,"w",null,null,null,"q",null,null,null,null,3]
[null,null,null,null,null,"o",null,null,null,null,null,null,1,null,null,null,null,null,null,null,null,null,null,null,null,1,null,null,null,null,"k",null,null,null,null,null,null,null,1,null,null,null,null,null,null,null,null,null,null,null,null,3,null,null,null,null,null,null,null,null,null,null,null,null,1,null,null,null,null,null,null,null,null,null,null,null,null,2,null,null,null,null,null,null,null,null,null,null,null,null,1,null,null,null,null,null,null,null,null,null,null,null,null,2]
[null,{"$f":"SUM(C637:L637)","v":20},2,4,3,3,1,0,3,2,1,1,{"$f":"SUM(M627:M636)","v":20},null,{"$f":"SUM(P637:Y637)","v":20},2,3,0,2,4,1,0,3,0,5,{"$f":"SUM(Z627:Z636)","v":20},null,{"$f":"SUM(AC637:AL637)","v":20},2,3,3,2,0,1,3,1,4,1,{"$f":"SUM(AM627:AM636)","v":20},null,{"$f":"SUM(AP637:AY637)","v":20},1,2,2,5,1,3,1,0,3,2,{"$f":"SUM(AZ627:AZ636)","v":20},null,{"$f":"SUM(BC637:BL637)","v":20},1,4,2,0,2,0,5,2,1,3,{"$f":"SUM(BM627:BM636)","v":20},null,{"$f":"SUM(BP637:BY637)","v":20},3,0,2,1,1,2,6,1,3,1,{"$f":"SUM(BZ627:BZ636)","v":20},null,{"$f":"SUM(CC637:CL637)","v":20},3,1,4,1,1,1,2,1,3,3,{"$f":"SUM(CM627:CM636)","v":20},null,{"$f":"SUM(CP637:CY637)","v":20},3,2,0,1,2,4,2,1,1,4,{"$f":"SUM(CZ627:CZ636)","v":20}]
[null,null,"Lösung",null,null,null,null,null,null,null,null,null,null,null,null,"Lösung",null,null,null,null,null,null,null,null,null,null,null,null,"Lösung",null,null,null,null,null,null,null,null,null,null,null,null,"Lösung",null,null,null,null,null,null,null,null,null,null,null,null,"Lösung",null,null,null,null,null,null,null,null,null,null,null,null,"Lösung",null,null,null,null,null,null,null,null,null,null,null,null,"Lösung",null,null,null,null,null,null,null,null,null,null,null,null,"Lösung"]
[null,201,"x","x","x","w","w","w","w","w","w","x",4,null,202,"w","w","w","x","w","w","w","w","w","w",1,null,203,"w","x","w","w","w","w","w","w",2,2,3,null,204,"w","w","w","x","w","w","w","w","w","w",1,null,205,"w","w","w","w","u","w","w","w","w","w",1,null,206,"w","w","w","w","w","x","x","w","x","x",4,null,207,"w","w","x","w","w","w","w","w","w","w",1,null,208,"w","w","w","w","w","w","w","w","w","u",1]
[null,"Tagi, 17.12.21","w","w","w","w","w","w","k","w","w","w",1,null,"Tagi, 18.12.21","w","w","w","w","w","w","w","w","w",4,1,null,"Tagi, 20.12.21","w","w","w","w","w","w","k","w","w","w",1,null,"Tagi, 21.12.21","w","w","w","w","w",3,"w","w","w","w",1,null,"Migros-Magazin, 20.12.21","w","x","w","w","o","w",3,"w","w","w",3,null,"Tagi, 23.12.21","w","w","k","w","w","w","w","w","w","w",1,null,"Tagi, 24.12.21","w","w","w","w","w","w","w","w","w","w",0,null,"Tagi, 27.12.21","w","w","w","w","x","x","x","x","w","x",5]
[null,null,"w","x","w","w","w","w","w","w","w","w",1,null,null,"w","x","w","w","w","w","w","x","w",4,3,null,null,"w","w","w","w","w","w","w","w","x","w",1,null,null,"w","w","x","x","w",3,"w","w","w","w",3,null,null,"w","o","w","w","w","w",3,"w","w","w",2,null,null,"w","w","w","w","w","w",4,"w","x","w",2,null,null,"w","w","w","w","w","w","w","w","x","w",1,null,null,"x","w","w","w","w","w","w","w","w","w",1]
[null,null,"w","w","w","w","w","w","w","w","w","w",0,null,null,"w","x","w","x","x","x","w","x","w",4,6,null,null,"w","w","w","w","w","x","x","w","x","w",3,null,null,"w","w","w","w","w",3,"w","w","w","w",1,null,null,"w","w","w","w","w","w",3,"w","w","x",2,null,null,"w","w",3,3,3,"w",4,"w","w","w",4,null,null,"x","x","x","l","w","x","x","w","o","w",7,null,null,"q","w","w","w","w","w","w","w","w","w",1]
[null,null,"w","x","x","w","x","w","x",3,3,"w",6,null,null,"w","w","w","w","w","w","w","w","w","x",1,null,null,4,4,4,4,"w","w","w","w","x","w",5,null,null,"w","w","w","w","w","w","w","w",3,"w",1,null,null,"w","w","w","w","w","w","w","w","w","w",0,null,null,"w","w","w","w","w","w",4,"w","w","w",1,null,null,"w","w","w","w","w","w","w","w","w","w",0,null,null,"x","w","w","w","w","x","w","w","w","w",2]
[null,null,"w","w","w","w","w","w","w","w","w","w",0,null,null,"u","w","w","w","w","w","w","w","w","w",1,null,null,"w","w","w","w","w","w","w","w","w","w",0,null,null,"w",4,4,4,4,"w","w","w",3,"w",5,null,null,"x","x","x","w","w","w","w","w","w","x",4,null,null,"w","w","w","w","w","w",4,"w","x","w",2,null,null,"w","w","w","w","w","w",3,3,3,"w",3,null,null,"w","w","w","x","w","x","w","w",2,"x",4]
[null,null,"x","x","q","x","w","w","x","x","w","w",6,null,null,"o","w","w","w","x","w","w","w","w","w",2,null,null,"w",3,3,"x","w","w","w","w","w","w",3,null,null,"w","w","w","w","w","w","k","w","x","w",2,null,null,"w","w","w","w","w","w",2,2,"w","w",2,null,null,"w","w","w","w","w","w","w","w","w","w",0,null,null,"x","w","k","w","x","w","w","w","w","w",3,null,null,"w","w","w","w","w","w","w","w","w","w",0]
[null,null,"w","w","w","w","w","w","w","w","w","w",0,null,null,"w","w","w","w",3,"w","w","k","w","w",2,null,null,"w","w","w","w","w","w","r","l","w","w",2,null,null,"k","w","w","w","w","w","w","w","w","w",1,null,null,"w","k","w","w","w","w","w","w","w","w",1,null,null,"x","w","w","w","w","w","x","l","w","w",3,null,null,"x","w","w","w","w","w","w","w","w",3,2,null,null,"w","x","w","w","w","w","w","w","w","w",1]
[null,null,"w","w","w","x","w","w","w","w","w","w",1,null,null,"w","w","w","w",3,"w","w","w","w","x",2,null,null,"x","w","w","w","w","w","w","w","w","w",1,null,null,"w","w","w","x","w","w","w","w","w","x",2,null,null,"w","w","w","w","w","w","x","q","x","x",4,null,null,"q","w","w","w","w","w","w","w","w","w",1,null,null,"w","w","x","w","w","w","w","w","w",3,2,null,null,"w","w","w","w","x","q","x","w","w","w",3]
[null,null,"w","w","w","o","w","w","w","w","w","w",1,null,null,"w","x","w","w","w","w","w","w","w","w",1,null,null,"w","w","k","w","w","w","w","w","w","w",1,null,null,"w","x","w","x","w","w","w","w","w","x",3,null,null,"w","w","x","w","w","w","w","w","w","w",1,null,null,"x","w","w","w","w","x","w","w","w","w",2,null,null,"w","w","w","w","w","w","w","w","w",3,1,null,null,"w","x","w","w","w","w","w","w","w","x",2]
[null,{"$f":"SUM(C649:L649)","v":20},2,4,3,3,1,0,3,2,1,1,{"$f":"SUM(M639:M648)","v":20},null,{"$f":"SUM(P649:Y649)","v":20},2,3,0,2,4,1,0,3,0,5,{"$f":"SUM(Z639:Z648)","v":20},null,{"$f":"SUM(AC649:AL649)","v":20},2,3,3,2,0,1,3,1,4,1,{"$f":"SUM(AM639:AM648)","v":20},null,{"$f":"SUM(AP649:AY649)","v":20},1,2,2,5,1,3,1,0,3,2,{"$f":"SUM(AZ639:AZ648)","v":20},null,{"$f":"SUM(BC649:BL649)","v":20},1,4,2,0,2,0,5,2,1,3,{"$f":"SUM(BM639:BM648)","v":20},null,{"$f":"SUM(BP649:BY649)","v":20},3,0,2,1,1,2,6,1,3,1,{"$f":"SUM(BZ639:BZ648)","v":20},null,{"$f":"SUM(CC649:CL649)","v":20},3,1,4,1,1,1,2,1,3,3,{"$f":"SUM(CM639:CM648)","v":20},null,{"$f":"SUM(CP649:CY649)","v":20},3,2,0,1,2,4,2,1,1,4,{"$f":"SUM(CZ639:CZ648)","v":20}]
[]
[null,null,"Tagi, 28.12.21",null,null,null,null,null,null,null,null,null,null,null,null,"Tagi, 29.12.21",null,null,null,null,null,null,null,null,null,null,null,null,"Tagi, 30.12.21",null,null,null,null,null,null,null,null,null,null,null,null,"Tagi, 31.01.21",null,null,null,null,null,null,null,null,null,null,null,null,"Tagi, 03.01.22",null,null,null,null,null,null,null,null,null,null,null,null,"Tagi, 04.01.22",null,null,null,null,null,null,null,null,null,null,null,null,"Tagi, 05.01.22",null,null,null,null,null,null,null,null,null,null,null,null,"Tagi, 06.01.22"]
[null,209,null,null,null,null,null,null,null,null,null,null,1,null,210,null,null,null,null,null,null,null,null,null,"k",2,null,211,null,null,null,null,null,null,null,null,null,"k",3,null,212,null,null,null,null,null,null,null,null,null,null,1,null,213,null,null,null,null,null,null,"k",null,null,null,1,null,214,null,null,null,null,"q",null,null,null,null,null,3,null,215,null,null,null,null,null,null,null,null,null,null,2,null,216,"k",null,null,null,null,null,null,null,null,null,1]
[null,"Tagi, 28.12.21",null,null,null,null,null,null,null,null,null,null,4,null,"Tagi, 29.12.21",null,null,null,null,null,null,null,null,null,null,0,null,"Tagi, 30.12.21",null,null,null,null,null,null,null,null,null,null,0,null,"Tagi, 31.01.21",null,null,null,null,null,null,null,null,null,null,3,null,"Tagi, 03.01.22",null,null,null,null,null,null,null,null,null,null,1,null,"Tagi, 04.01.22",null,null,null,null,null,null,null,null,null,null,3,null,"Tagi, 05.01.22",null,null,null,null,"l",null,null,null,null,null,3,null,"Tagi, 06.01.22",null,null,null,null,null,null,null,null,null,null,0]
[null,null,null,null,null,null,null,"q",null,null,null,null,1,null,null,null,null,null,null,null,null,null,null,null,null,2,null,null,null,null,null,"l",null,null,null,null,null,null,6,null,null,null,null,null,"q",null,null,null,null,null,null,5,null,null,null,null,null,null,null,null,null,null,null,null,0,null,null,null,null,null,null,null,null,null,null,null,null,2,null,null,"q",null,null,null,null,null,null,null,null,null,1,null,null,null,null,"l",null,null,null,null,null,null,null,3]
[null,null,null,null,null,null,null,null,null,null,null,null,2,null,null,null,null,null,null,null,null,null,null,null,null,3,null,null,null,null,null,null,null,null,null,null,null,null,2,null,null,null,null,null,null,null,null,null,null,null,null,2,null,null,null,null,null,null,"k",null,null,null,null,null,2,null,null,null,null,null,null,null,null,"k",null,null,null,1,null,null,null,null,null,null,null,null,null,null,null,null,1,null,null,null,null,null,null,null,null,null,null,null,null,5]
[null,null,null,null,null,null,null,null,null,null,null,null,3,null,null,null,null,null,null,null,null,null,null,null,null,2,null,null,null,null,null,null,null,null,null,null,null,null,1,null,null,null,null,null,null,null,null,null,null,null,null,0,null,null,null,null,null,null,null,null,null,null,null,null,3,null,null,null,null,null,null,null,null,null,null,null,null,0,null,null,null,null,null,null,null,null,null,null,null,null,2,null,null,null,null,null,null,null,null,null,null,null,null,2]
[null,null,null,null,null,null,null,null,null,null,null,null,1,null,null,null,null,null,null,null,null,null,null,"l",null,3,null,null,null,null,null,null,null,null,null,null,null,null,3,null,null,null,null,null,null,null,"r",null,null,null,null,4,null,null,null,null,null,null,null,null,null,null,null,null,3,null,null,null,null,null,null,"l",null,null,null,null,null,4,null,null,"k",null,null,null,null,null,null,null,null,null,2,null,null,null,null,null,null,null,null,null,null,null,null,1]
[null,null,null,null,null,null,null,null,null,null,"l",null,4,null,null,null,null,null,null,null,null,null,null,null,null,1,null,null,null,null,null,null,null,null,null,null,"l",null,2,null,null,null,null,null,null,null,null,null,null,null,null,0,null,null,null,null,null,null,null,null,null,null,null,null,4,null,null,null,null,null,null,null,null,null,null,null,null,0,null,null,null,null,null,null,null,null,null,null,null,null,2,null,null,null,null,null,null,null,null,null,null,null,null,0]
[null,null,"o",null,null,null,null,null,null,null,null,null,1,null,null,null,null,"o",null,"w",null,null,null,null,null,2,null,null,null,null,null,null,null,null,null,null,null,null,0,null,null,null,"k",null,null,null,null,null,null,null,null,1,null,null,"r",null,null,null,null,null,"o",null,null,null,3,null,null,null,null,null,null,null,null,null,null,"l",null,5,null,null,null,null,null,null,null,null,null,null,null,null,3,null,null,null,null,null,null,null,null,null,null,"u",null,3]
[null,null,null,null,null,null,null,null,null,null,null,null,2,null,null,null,null,null,null,null,null,null,null,null,null,1,null,null,null,null,"w",null,null,null,null,null,null,null,2,null,null,null,null,null,null,null,null,null,null,null,null,2,null,null,null,null,null,null,null,null,null,null,null,null,0,null,null,null,null,null,null,null,null,null,null,null,null,1,null,null,null,null,null,null,null,null,null,null,null,null,3,null,null,null,null,null,null,null,null,null,null,null,null,2]
[null,null,null,null,null,null,"k",null,null,null,null,null,1,null,null,null,null,null,null,null,null,null,null,null,null,4,null,null,null,null,null,null,null,null,null,null,null,null,1,null,null,null,null,null,null,null,"o",null,null,null,null,2,null,null,null,null,null,null,null,null,null,null,null,null,3,null,null,null,null,null,null,null,null,null,null,null,null,1,null,null,null,null,null,"k",null,null,null,null,null,null,1,null,null,null,"k",null,null,null,null,null,null,null,null,3]
[null,{"$f":"SUM(C662:L662)","v":20},2,0,2,3,1,4,2,1,2,3,{"$f":"SUM(M652:M661)","v":20},null,{"$f":"SUM(P662:Y662)","v":20},1,5,3,0,5,0,0,3,2,1,{"$f":"SUM(Z652:Z661)","v":20},null,{"$f":"SUM(AC662:AL662)","v":20},2,1,2,2,4,3,0,4,1,1,{"$f":"SUM(AM652:AM661)","v":20},null,{"$f":"SUM(AP662:AY662)","v":20},1,3,2,1,1,3,5,0,3,1,{"$f":"SUM(AZ652:AZ661)","v":20},null,{"$f":"SUM(BC662:BL662)","v":20},1,4,0,1,3,0,5,0,1,5,{"$f":"SUM(BM652:BM661)","v":20},null,{"$f":"SUM(BP662:BY662)","v":20},3,2,2,3,2,1,2,1,1,3,{"$f":"SUM(BZ652:BZ661)","v":20},null,{"$f":"SUM(CC662:CL662)","v":20},4,2,0,6,1,0,4,2,0,1,{"$f":"SUM(CM652:CM661)","v":20},null,{"$f":"SUM(CP662:CY662)","v":20},2,3,1,0,2,1,4,2,3,2,{"$f":"SUM(CZ652:CZ661)","v":20}]
[null,null,"Lösung",null,null,null,null,null,null,null,null,null,null,null,null,"Lösung",null,null,null,null,null,null,null,null,null,null,null,null,"Lösung",null,null,null,null,null,null,null,null,null,null,null,null,"Lösung",null,null,null,null,null,null,null,null,null,null,null,null,"Lösung",null,null,null,null,null,null,null,null,null,null,null,null,"Lösung",null,null,null,null,null,null,null,null,null,null,null,null,"Lösung",null,null,null,null,null,null,null,null,null,null,null,null,"Lösung"]
[null,209,"w","w","x","w","w","w","w","w","w","w",1,null,210,"w","x","w","w","w","w","w","w","w","k",2,null,211,"w","w","x","w","x","w","w","w","w","k",3,null,212,"w","w","w","w","w","w","x","w","w","w",1,null,213,"w","w","w","w","w","w","k","w","w","w",1,null,214,"w","w","w","x","q","x","w","w","w","w",3,null,215,"w","w","w","w","w","w","x","x","w","w",2,null,216,"k","w","w","w","w","w","w","w","w","w",1]
[null,"Tagi, 28.12.21","w","w","x","w","w",4,"w","w","x","x",4,null,"Tagi, 29.12.21","w","w","w","w","w","w","w","w","w","w",0,null,"Tagi, 30.12.21","w","w","w","w","w","w","w","w","w","w",0,null,"Tagi, 31.01.21","x","w","w","w","w","w","x","w",3,"w",3,null,"Tagi, 03.01.22","w","w","w","w","w","w","w","w","w","x",1,null,"Tagi, 04.01.22","x","x","w","w","w","w","w","w","w","x",3,null,"Tagi, 05.01.22","x","w","w","x","l","w","w","w","w","w",3,null,"Tagi, 06.01.22","w","w","w","w","w","w","w","w","w","w",0]
[null,null,"w","w","w","w","w",4,"w","w","w","w",1,null,null,"w","x","w","w",4,"w","w","w","w","w",2,null,null,"x","x","x","l","w","x","w",3,"w","w",6,null,null,"w","w","x","q","x","w","x","w",3,"w",5,null,null,"w","w","w","w","w","w","w","w","w","w",0,null,null,"w","w","w","x","w","w","w","w","w","x",2,null,null,"q","w","w","w","w","w","w","w","w","w",1,null,null,"w","x","l","w","w","w","w","w","w","x",3]
[null,null,"w","w","w",3,"w",4,"w","w","w","w",2,null,null,"w","x","w","w",4,"w","w","w","x","w",3,null,null,"w","w","w","w","w","x","w",3,"w","w",2,null,null,"w","w","w","w","w","w","x","w",3,"w",2,null,null,"w",3,"w","w","k","w","w","w","w","w",2,null,null,"w","w","w","w","w","w","k","w","w","w",1,null,null,"x","w","w","w","w","w","w","w","w","w",1,null,null,"w","w","w","w","x","x","x","x","w","x",5]
[null,null,"w","w","w",3,"w","x","w","w","w","x",3,null,null,"w","x","w","w",4,"w","w","w","w","w",2,null,null,"w","w","w","w","w","w","w",3,"w","w",1,null,null,"w","w","w","w","w","w","w","w","w","w",0,null,null,"w",3,"w","w","w","w","x","w","w",3,3,null,null,"w","w","w","w","w","w","w","w","w","w",0,null,null,"w","w","w","x","w","w","w","x","w","w",2,null,null,"x","x","w","w","w","w","w","w","w","w",2]
[null,null,"w","w","w",3,"w","w","w","w","w","w",1,null,null,"w","w","w","w",4,"w","w","x","l","w",3,null,null,"w","w","w","x","x","x","w","w","w","w",3,null,null,"w","x","x","w","w","r","x","w","w","w",4,null,null,"w",3,"w","w","w","w","x","w","w",3,3,null,null,"w",4,4,4,"l","w","w","w","w","w",4,null,null,"k","w","w","x","w","w","w","w","w","w",2,null,null,"w","w","w","w","w","w","w","x","w","w",1]
[null,null,"u","w","w","w","w","w","x","x","l","w",4,null,null,"w","w","x","w","w","w","w","w","w","w",1,null,null,"w","w","w","w","w","w","w","r","l","w",2,null,null,"w","w","w","w","w","w","w","w","w","w",0,null,null,"w","w","w","x","x","w","x","w","w",3,4,null,null,"w","w","w","w","w","w","w","w","w","w",0,null,null,"w","w","w","x","w","w",3,"w","w","w",2,null,null,"w","w","w","w","w","w","w","w","w","w",0]
[null,null,"o","w","w","w","w","w","w","w","w","w",1,null,null,"w","w","o","w","w","w","w","x","w","w",2,null,null,"w","w","w","w","w","w","w","w","w","w",0,null,null,"w","k","w","w","w","w","w","w","w","w",1,null,null,"r","x","w","w","w","w","x","w","w","w",3,null,null,"x","w","x","w","w","w","x","x","l","w",5,null,null,"w","x","w","x","w","w",3,"w","w","w",3,null,null,"w","w","w","w","x","w","x","w","u","w",3]
[null,null,"w","w","w","w","w","w","x","w","w","x",2,null,null,"w","w","w","w","w","w","w",2,"w","w",1,null,null,"x","w","w","w","x","w","w","w","w","w",2,null,null,"w","w","w","w","w","x","w","w","w","x",2,null,null,"w","w","w","w","w","w","w","w","w","w",0,null,null,"x","w","w","w","w","w","w","w","w","w",1,null,null,"w","x","w","w","w","w",3,"w","w","x",3,null,null,"w","w","w","w","w","w","x","w","x","w",2]
[null,null,"w","w","w","w","k","w","w","w","w","w",1,null,null,3,3,3,"w","x","w","w","w","w","w",4,null,null,"w","w","w","w","x","w","w","w","w","w",1,null,null,"w","x","w","w","w","o","w","w","w","w",2,null,null,"w","w","w","w","x","w","w","w","x","x",3,null,null,"w","w","w","w","w","w","w","w","w","x",1,null,null,"w","w","w","k","w","w","w","w","w","w",1,null,null,"w","k","w","w","w","w","x","w","x","w",3]
[null,{"$f":"SUM(C674:L674)","v":20},2,0,2,3,1,4,2,1,2,3,{"$f":"SUM(M664:M673)","v":20},null,{"$f":"SUM(P674:Y674)","v":20},1,5,3,0,5,0,0,3,2,1,{"$f":"SUM(Z664:Z673)","v":20},null,{"$f":"SUM(AC674:AL674)","v":20},2,1,2,2,4,3,0,4,1,1,{"$f":"SUM(AM664:AM673)","v":20},null,{"$f":"SUM(AP674:AY674)","v":20},1,3,2,1,1,3,5,0,3,1,{"$f":"SUM(AZ664:AZ673)","v":20},null,{"$f":"SUM(BC674:BL674)","v":20},1,4,0,1,3,0,5,0,1,5,{"$f":"SUM(BM664:BM673)","v":20},null,{"$f":"SUM(BP674:BY674)","v":20},3,2,2,3,2,1,2,1,1,3,{"$f":"SUM(BZ664:BZ673)","v":20},null,{"$f":"SUM(CC674:CL674)","v":20},4,2,0,6,1,0,4,2,0,1,{"$f":"SUM(CM664:CM673)","v":20},null,{"$f":"SUM(CP674:CY674)","v":20},2,3,1,0,2,1,4,2,3,2,{"$f":"SUM(CZ664:CZ673)","v":20}]
[]
[null,null,"Tagi, 07.01.22",null,null,null,null,null,null,null,null,null,null,null,null,"Tagi, 08.01.22",null,null,null,null,null,null,null,null,null,null,null,null,"Tagi, 10.01.22",null,null,null,null,null,null,null,null,null,null,null,null,"Tagi, 11.01.22",null,null,null,null,null,null,null,null,null,null,null,null,"Tagi, 12.01.22",null,null,null,null,null,null,null,null,null,null,null,null,"Tagi, 13.01.22",null,null,null,null,null,null,null,null,null,null,null,null,"Tagi, 14.01.22",null,null,null,null,null,null,null,null,null,null,null,null,"Tagi, 15.01.22"]
[null,217,null,null,null,null,null,null,null,null,null,null,1,null,218,null,null,null,null,null,null,null,null,"q",null,3,null,219,null,null,null,null,null,null,"r",null,null,null,3,null,220,null,null,null,null,null,null,null,null,null,null,2,null,221,null,null,null,null,null,null,null,null,null,null,5,null,222,null,null,null,null,null,null,null,null,null,null,3,null,223,null,null,null,null,null,null,null,null,null,null,2,null,224,null,null,null,null,null,null,null,null,null,"w",3]
[null,"Tagi, 07.01.22",null,null,null,null,null,null,null,"k",null,null,1,null,"Tagi, 08.01.22",null,null,"w",null,null,null,null,null,null,null,4,null,"Tagi, 10.01.22",null,null,null,null,null,null,null,null,null,null,1,null,"Tagi, 11.01.22",null,null,null,null,null,null,null,null,null,null,2,null,"Tagi, 12.01.22",null,null,null,null,null,null,null,null,null,null,0,null,"Tagi, 13.01.22",null,null,"l",null,null,null,null,null,null,null,2,null,"Tagi, 14.01.22",null,null,null,null,null,null,null,null,null,null,0,null,"Tagi, 15.01.22",null,null,null,null,null,null,null,null,null,null,1]
[null,null,null,null,null,null,null,null,null,null,null,null,0,null,null,null,null,null,null,null,null,null,null,null,null,0,null,null,null,null,null,null,null,null,null,null,null,null,5,null,null,null,null,null,null,null,null,null,null,null,null,2,null,null,"r",null,null,null,null,null,null,null,null,null,2,null,null,null,null,null,null,null,null,null,null,null,null,0,null,null,null,null,null,null,null,null,null,null,null,null,5,null,null,null,null,null,null,null,null,null,null,null,null,3]
[null,null,null,null,null,null,null,null,null,null,null,null,3,null,null,null,null,null,null,null,null,null,null,null,null,0,null,null,null,null,null,null,null,null,null,null,null,null,0,null,null,null,null,null,null,null,null,null,null,null,null,6,null,null,null,null,null,null,null,null,null,null,"l",null,3,null,null,null,null,null,null,null,"u",null,null,null,null,1,null,null,null,null,null,null,null,null,null,null,null,null,2,null,null,null,null,null,null,null,null,null,null,null,null,3]
[null,null,null,null,null,null,null,null,null,null,null,null,3,null,null,null,null,null,null,null,null,null,null,null,null,4,null,null,null,null,null,null,"r",null,null,null,null,null,2,null,null,null,null,null,null,null,null,null,null,null,null,0,null,null,null,null,null,null,null,null,null,null,null,null,2,null,null,null,null,null,null,null,null,null,null,null,null,3,null,null,"u",null,null,null,null,null,null,null,null,null,2,null,null,null,null,null,null,null,null,null,null,"o",null,1]
[null,null,null,null,null,null,"q",null,null,null,null,null,5,null,null,null,null,null,null,null,null,null,null,null,null,0,null,null,null,"u",null,null,null,null,null,null,null,null,1,null,null,null,null,null,null,null,null,null,null,null,null,1,null,null,null,null,null,null,null,"k",null,null,null,null,2,null,null,null,null,null,null,null,null,null,null,null,null,2,null,null,null,null,null,null,null,null,null,null,null,null,2,null,null,null,null,null,null,null,null,null,null,null,null,1]
[null,null,null,null,null,null,null,null,null,null,null,null,1,null,null,null,null,null,null,null,null,null,null,null,null,5,null,null,null,null,null,null,null,null,null,null,null,null,2,null,null,null,null,null,null,null,null,null,"q",null,null,1,null,null,null,null,null,null,null,null,null,null,null,null,0,null,null,null,null,null,null,null,null,null,null,null,null,2,null,null,null,null,"o",null,"k",null,null,null,null,null,4,null,null,null,null,null,null,null,null,null,null,null,null,1]
[null,null,null,null,null,null,null,null,null,null,null,null,2,null,null,null,null,null,null,null,null,null,null,null,null,2,null,null,null,null,null,null,null,null,null,null,null,null,2,null,null,null,null,null,null,null,null,null,null,null,null,3,null,null,null,null,null,null,null,null,null,null,null,null,1,null,null,"k",null,null,null,null,null,null,null,null,null,3,null,null,null,null,null,null,null,null,null,null,null,null,0,null,null,null,null,null,null,null,null,null,"l",null,null,4]
[null,null,null,null,null,null,null,null,"k",null,"q",null,3,null,null,null,null,null,null,null,null,null,null,null,null,1,null,null,null,null,null,null,null,null,null,null,null,null,2,null,null,null,null,null,null,null,null,null,null,null,null,0,null,null,null,null,null,null,null,null,null,"u",null,null,4,null,null,null,null,null,null,null,null,null,"q",null,null,3,null,null,null,null,null,null,null,null,null,null,"u",null,1,null,null,null,null,null,null,null,null,null,null,null,null,0]
[null,null,null,null,null,null,null,null,null,null,null,null,1,null,null,null,null,null,null,null,null,"k",null,null,null,1,null,null,null,null,null,null,"k",null,null,null,null,null,2,null,null,null,null,"k",null,null,"w",null,null,null,null,3,null,null,null,null,null,null,null,null,null,null,null,null,1,null,null,null,null,null,null,null,null,null,null,null,null,1,null,null,null,null,null,null,null,null,null,null,null,null,2,null,null,null,"k",null,null,null,null,null,null,null,null,3]
[null,{"$f":"SUM(C687:L687)","v":20},1,3,1,1,2,2,3,2,3,2,{"$f":"SUM(M677:M686)","v":20},null,{"$f":"SUM(P687:Y687)","v":20},2,3,1,5,1,2,1,1,1,3,{"$f":"SUM(Z677:Z686)","v":20},null,{"$f":"SUM(AC687:AL687)","v":20},4,2,0,2,3,2,1,5,0,1,{"$f":"SUM(AM677:AM686)","v":20},null,{"$f":"SUM(AP687:AY687)","v":20},2,0,1,5,2,3,0,4,1,2,{"$f":"SUM(AZ677:AZ686)","v":20},null,{"$f":"SUM(BC687:BL687)","v":20},2,3,2,0,1,2,2,4,3,1,{"$f":"SUM(BM677:BM686)","v":20},null,{"$f":"SUM(BP687:BY687)","v":20},2,1,4,0,0,5,0,4,3,1,{"$f":"SUM(BZ677:BZ686)","v":20},null,{"$f":"SUM(CC687:CL687)","v":20},5,2,3,2,1,0,0,4,2,1,{"$f":"SUM(CM677:CM686)","v":20},null,{"$f":"SUM(CP687:CY687)","v":20},5,1,1,3,0,1,1,2,3,3,{"$f":"SUM(CZ677:CZ686)","v":20}]
[null,null,"Lösung",null,null,null,null,null,null,null,null,null,null,null,null,"Lösung",null,null,null,null,null,null,null,null,null,null,null,null,"Lösung",null,null,null,null,null,null,null,null,null,null,null,null,"Lösung",null,null,null,null,null,null,null,null,null,null,null,null,"Lösung",null,null,null,null,null,null,null,null,null,null,null,null,"Lösung",null,null,null,null,null,null,null,null,null,null,null,null,"Lösung",null,null,null,null,null,null,null,null,null,null,null,null,"Lösung"]
[null,217,"w","w","x","w","w","w","w","w","w","w",1,null,218,"w","w","w","w","w","w","w","x","q","x",3,null,219,"x","w","w","w","w","w","r","x","w","w",3,null,220,"w","w","w","x","w","x","w","w","w","w",2,null,221,"w","w","w","w","x","w",4,4,"x","x",5,null,222,"w","w","w","w","w","x","w","x","x","w",3,null,223,2,2,"w","w","w","w","w","w","w","w",2,null,224,4,"w",2,2,"w","w","w","w","w","w",3]
[null,"Tagi, 07.01.22","w","w","w","w","w","w","w","k","w","w",1,null,"Tagi, 08.01.22","x","x","w","x","w","x","w","w","w","w",4,null,"Tagi, 10.01.22","x","w","w","w","w","w","w","w","w","w",1,null,"Tagi, 11.01.22","w","w","w","x","w","x","w","w","w","w",2,null,"Tagi, 12.01.22","w","w","w","w","w","w","w","w","w","w",0,null,"Tagi, 13.01.22","w","r","l","w","w","w","w","w","w","w",2,null,"Tagi, 14.01.22","w","w","w","w","w","w","w","w","w","w",0,null,"Tagi, 15.01.22",4,"w","w","w","w","w","w","w","w","w",1]
[null,null,"w","w","w","w","w","w","w","w","w","w",0,null,null,"w","w","w","w","w","w","w","w","w","w",0,null,null,"x","w","w","x","x","x","w","w","w","x",5,null,null,2,"w","w","x","w","w","w","w","w","w",2,null,null,"r","l","w","w","w","w","w","w","w","w",2,null,null,"w","w","w","w","w","w","w","w","w","w",0,null,null,4,4,4,4,"w","w","w","x","w","w",5,null,null,4,"w","w",2,"w","w","w","w",3,"w",3]
[null,null,"w","w","w","w","w",3,3,"x","w","w",3,null,null,"w","w","w","w","w","w","w","w","w","w",0,null,null,"w","w","w","w","w","w","w","w","w","w",0,null,null,"x","w","w","x","w","x","w","x","x","x",6,null,null,"w","w","w","w","w","w","x","x","l","w",3,null,null,"w","w","w","w","w","u","w","w","w","w",1,null,null,"w","w","w","w","w","w","w","x","w","x",2,null,null,4,"w","w",2,"w","w","w","w",3,"w",3]
[null,null,"x","x","w","w","w","w","w","w","w","x",3,null,null,"w","x","x","x","x","w","w","w","w","w",4,null,null,"w","w","w","w","r","l","w","w","w","w",2,null,null,"w","w","w","w","w","w","w","w","w","w",0,null,null,"w","x","x","w","w","w","w","w","w","w",2,null,null,"x","w","w","w","w","x","w","w","x","w",3,null,null,"u","w","w","w","w","w","w","x","w","w",2,null,null,"w","w","w","w","w","w","w","w",3,"w",1]
[null,null,"w","w","w","x","q","x","x","w","w","x",5,null,null,"w","w","w","w","w","w","w","w","w","w",0,null,null,"w","u","w","w","w","w","w","w","w","w",1,null,null,"w","w","w","w","w","w","w","x","w","w",1,null,null,"w","w","w","w","w","k","w","w","x","w",2,null,null,"w","w","w","w","w",4,"w","w","x","w",2,null,null,"x","w","x","w","w","w","w","w","w","w",2,null,null,"x","w","w","w","w","w","w","w","w","w",1]
[null,null,"w","x","w","w","w","w","w","w","w","w",1,null,null,"x","x","w","x","w","x","w","w","w","x",5,null,null,"w","o","w","w","w","w","w",4,"w","w",2,null,null,"w","w","w","w","w","w","w","q","w","w",1,null,null,"w","w","w","w","w","w","w","w","w","w",0,null,null,"w","w","x","w","w",4,"w","w","w","w",2,null,null,"x","w","o","w","k","w","w","x","w","w",4,null,null,"w","w","w","w","w","w","w","w","w","x",1]
[null,null,"w",2,"w","w","w","w","w","w","x","w",2,null,null,"w","w","w","x","w","w","w","w","w","x",2,null,null,"w","w","w","x","w","w","w",4,"w","w",2,null,null,"w","w","w","x","x","w","w","x","w","w",3,null,null,"w","w","w","w","w","x","w","w","w","w",1,null,null,"k","w","x","w","w","w","w","x","w","w",3,null,null,"w","w","w","w","w","w","w","w","w","w",0,null,null,"w","w","w","w","w",3,3,3,"w","x",4]
[null,null,"w","w","w","w","x","w","k","w","q","w",3,null,null,"w","w","w","x","w","w","w","w","w","w",1,null,null,"x","w","w","w","w","w","w",4,"w","w",2,null,null,"w","w","w","w","w","w","w","w","w","w",0,null,null,3,3,3,"w","w","w","w","u","w","w",4,null,null,"w","w","x","w","w","w","w","q","w","x",3,null,null,"w","w","w","w","w","w","w","w","u","w",1,null,null,"w","w","w","w","w","w","w","w","w","w",0]
[null,null,"w","w","w","w","w","w","w","w","x","w",1,null,null,"w","w","w","w","w","w","k","w","w","w",1,null,null,"w","w","w","w","k","w","w",4,"w","w",2,null,null,"w","w","k","w","x","w","w","w","w","x",3,null,null,"w","w","w","w","w","w","w","x","w","w",1,null,null,"w","w","w","w","w","w","w","x","w","w",1,null,null,"w","w","w","x","w","w","w","w","o","w",2,null,null,"w","k","w","w","w","w","w","x","w","x",3]
[null,{"$f":"SUM(C699:L699)","v":20},1,3,1,1,2,2,3,2,3,2,{"$f":"SUM(M689:M698)","v":20},null,{"$f":"SUM(P699:Y699)","v":20},2,3,1,5,1,2,1,1,1,3,{"$f":"SUM(Z689:Z698)","v":20},null,{"$f":"SUM(AC699:AL699)","v":20},4,2,0,2,3,2,1,5,0,1,{"$f":"SUM(AM689:AM698)","v":20},null,{"$f":"SUM(AP699:AY699)","v":20},2,0,1,5,2,3,0,4,1,2,{"$f":"SUM(AZ689:AZ698)","v":20},null,{"$f":"SUM(BC699:BL699)","v":20},2,3,2,0,1,2,2,4,3,1,{"$f":"SUM(BM689:BM698)","v":20},null,{"$f":"SUM(BP699:BY699)","v":20},2,1,4,0,0,5,0,4,3,1,{"$f":"SUM(BZ689:BZ698)","v":20},null,{"$f":"SUM(CC699:CL699)","v":20},5,2,3,2,1,0,0,4,2,1,{"$f":"SUM(CM689:CM698)","v":20},null,{"$f":"SUM(CP699:CY699)","v":20},5,1,1,3,0,1,1,2,3,3,{"$f":"SUM(CZ689:CZ698)","v":20}]
[]
[null,null,"Tagi, 17.01.22",null,null,null,null,null,null,null,null,null,null,null,null,"Tagi, 18.01.22",null,null,null,null,null,null,null,null,null,null,null,null,"Tagi, 19.01.22",null,null,null,null,null,null,null,null,null,null,null,null,"Tagi, 20.01.22",null,null,null,null,null,null,null,null,null,null,null,null,"Tagi, 21.01.22",null,null,null,null,null,null,null,null,null,null,null,null,"Beobachter, 21.01.22",null,null,null,null,null,null,null,null,null,null,null,null,"Tagi, 22.01.22",null,null,null,null,null,null,null,null,null,null,null,null,"Tagi, 24.01.22"]
[null,225,null,null,null,null,null,null,null,null,null,null,2,null,226,null,null,null,null,"u",null,null,null,null,null,1,null,227,null,null,"k",null,null,null,null,null,null,null,3,null,228,null,null,null,null,null,null,null,null,null,null,1,null,229,null,null,null,null,null,null,null,"r",null,null,4,null,230,null,null,null,null,null,null,null,null,null,null,0,null,231,null,null,null,null,null,null,null,null,null,null,1,null,232,null,null,null,null,null,null,null,null,null,null,1]
[null,"Tagi, 17.01.22",null,null,null,null,null,null,"w",null,null,null,1,null,"Tagi, 18.01.22",null,null,null,null,null,null,null,null,null,null,4,null,"Tagi, 19.01.22",null,null,null,null,null,null,null,null,null,null,2,null,"Tagi, 20.01.22",null,null,null,null,null,null,null,null,null,null,1,null,"Tagi, 21.01.22",null,null,null,null,null,null,null,null,null,null,0,null,"Beobachter, 21.01.22",null,null,null,null,null,null,null,null,null,null,0,null,"Tagi, 22.01.22",null,null,null,null,null,null,null,null,null,null,4,null,"Tagi, 24.01.22",null,null,null,null,null,null,null,null,null,null,0]
[null,null,null,null,null,null,null,null,null,null,null,null,3,null,null,null,null,null,null,null,null,null,null,null,null,1,null,null,null,null,null,null,null,null,null,null,null,null,1,null,null,null,null,"u",null,null,null,null,null,null,null,3,null,null,null,null,null,null,null,null,null,null,null,null,4,null,null,null,null,null,null,null,null,null,null,null,null,3,null,null,null,null,null,null,null,"k",null,null,null,null,2,null,null,null,null,null,null,null,null,"q",null,null,null,4]
[null,null,null,null,null,null,null,null,null,null,null,null,3,null,null,null,null,null,null,null,null,null,null,null,null,1,null,null,null,null,null,null,null,null,null,null,null,null,1,null,null,null,null,null,null,null,null,null,null,null,null,1,null,null,null,null,null,null,null,null,null,null,null,null,2,null,null,null,null,"k",null,null,null,null,null,null,null,2,null,null,null,null,null,null,null,null,null,null,null,null,3,null,null,null,null,null,null,null,null,null,null,null,null,3]
[null,null,null,null,null,null,null,null,null,null,"u",null,3,null,null,null,null,null,null,null,null,null,null,null,null,3,null,null,null,null,null,null,null,null,null,null,null,null,3,null,null,null,null,null,null,null,null,null,"k",null,null,1,null,null,null,"q",null,null,null,null,null,null,null,null,5,null,null,null,null,null,null,null,null,null,null,null,null,3,null,null,null,null,null,null,null,null,null,null,null,null,3,null,null,null,null,null,null,null,null,null,null,null,null,3]
[null,null,null,null,null,null,null,null,null,null,null,null,1,null,null,null,null,null,null,null,null,null,null,null,null,3,null,null,null,null,null,null,null,null,null,null,null,null,1,null,null,null,null,null,null,null,null,null,null,null,null,0,null,null,null,null,null,null,null,null,null,null,null,null,0,null,null,null,null,null,null,null,null,null,null,null,null,3,null,null,null,null,null,null,null,null,null,null,null,null,0,null,null,null,null,null,null,null,null,null,null,null,null,3]
[null,null,null,null,"r",null,null,null,null,null,null,null,3,null,null,null,null,null,null,null,null,null,null,null,null,2,null,null,null,null,null,null,null,null,null,null,null,null,0,null,null,null,null,null,null,null,null,null,null,"q",null,5,null,null,null,null,null,null,null,null,null,null,null,null,0,null,null,null,null,null,null,null,null,null,null,null,null,2,null,null,null,null,null,null,null,null,null,"q",null,null,4,null,null,null,null,null,null,null,null,null,null,null,null,1]
[null,null,null,null,null,null,null,null,null,null,null,null,2,null,null,null,null,null,null,null,null,null,null,"q",null,1,null,null,null,null,null,null,null,null,null,null,null,null,2,null,null,null,null,null,null,"u",null,null,null,null,null,3,null,null,null,"k",null,null,null,null,null,null,null,null,1,null,null,null,null,null,null,null,null,"r",null,null,null,2,null,null,null,null,null,null,null,null,null,null,null,null,1,null,null,null,null,null,null,null,null,null,null,"o",null,2]
[null,null,null,null,null,null,null,null,null,null,null,null,0,null,null,null,null,null,null,null,null,null,null,null,null,1,null,null,null,null,null,"k",null,null,null,null,null,null,4,null,null,null,null,null,null,null,null,null,null,null,null,2,null,null,null,null,null,null,"r",null,null,null,null,null,2,null,null,null,null,null,null,null,null,null,null,null,null,2,null,null,"o",null,null,null,null,null,null,null,null,null,1,null,null,null,null,null,null,null,null,null,null,null,null,0]
[null,null,null,null,"r",null,null,null,null,null,null,null,2,null,null,null,null,null,null,null,null,null,null,null,null,3,null,null,null,null,null,null,null,"k",null,"o",null,null,3,null,null,null,null,null,null,null,null,null,null,null,null,3,null,null,null,null,null,null,null,null,null,null,null,null,2,null,null,null,null,null,null,null,null,null,null,null,null,3,null,null,null,null,null,null,null,null,null,null,null,null,1,null,null,null,null,null,null,null,null,null,null,"k",null,3]
[null,{"$f":"SUM(C712:L712)","v":20},1,3,2,2,2,0,5,0,4,1,{"$f":"SUM(M702:M711)","v":20},null,{"$f":"SUM(P712:Y712)","v":20},2,4,0,0,4,1,0,4,3,2,{"$f":"SUM(Z702:Z711)","v":20},null,{"$f":"SUM(AC712:AL712)","v":20},3,4,1,1,2,2,3,3,0,1,{"$f":"SUM(AM702:AM711)","v":20},null,{"$f":"SUM(AP712:AY712)","v":20},1,0,5,1,3,2,2,4,1,1,{"$f":"SUM(AZ702:AZ711)","v":20},null,{"$f":"SUM(BC712:BL712)","v":20},1,4,4,1,2,2,0,3,1,2,{"$f":"SUM(BM702:BM711)","v":20},null,{"$f":"SUM(BP712:BY712)","v":20},0,0,2,1,3,1,6,2,3,2,{"$f":"SUM(BZ702:BZ711)","v":20},null,{"$f":"SUM(CC712:CL712)","v":20},3,0,6,0,1,2,1,2,2,3,{"$f":"SUM(CM702:CM711)","v":20},null,{"$f":"SUM(CP712:CY712)","v":20},3,1,0,6,1,1,3,1,3,1,{"$f":"SUM(CZ702:CZ711)","v":20}]
[null,null,"Lösung",null,null,null,null,null,null,null,null,null,null,null,null,"Lösung",null,null,null,null,null,null,null,null,null,null,null,null,"Lösung",null,null,null,null,null,null,null,null,null,null,null,null,"Lösung",null,null,null,null,null,null,null,null,null,null,null,null,"Lösung",null,null,null,null,null,null,null,null,null,null,null,null,"Lösung",null,null,null,null,null,null,null,null,null,null,null,null,"Lösung",null,null,null,null,null,null,null,null,null,null,null,null,"Lösung"]
[null,225,"x","w","w","w","w","w","x","w","w","w",2,null,226,"w","w","w","w","u","w","w","w","w","w",1,null,227,"w","w","k","w","x","w","x","w","w","w",3,null,228,"w","w","w","x","w","w","w","w","w","w",1,null,229,"w","w","x","w","w","w","w",3,3,3,4,null,230,"w","w","w","w","w","w","w","w","w","w",0,null,231,"w","w","x","w","w","w","w","w","w","w",1,null,232,"w","x","w","w","w","w","w","w","w","w",1]
[null,"Tagi, 17.01.22","w","w","w","w","w","w","w","w","w","x",1,null,"Tagi, 18.01.22","x","w","w","w","x","w","w","x","w","x",4,null,"Tagi, 19.01.22","w","w","w","w","x","w","x","w","w","w",2,null,"Tagi, 20.01.22","w","w","w","w","w","x","w","w","w","w",1,null,"Tagi, 21.01.22","w","w","w","w","w","w","w","w","w","w",0,null,"Beobachter, 21.01.22","w","w","w","w","w","w","w","w","w","w",0,null,"Tagi, 22.01.22","w","w","x","w","w","w","w",3,3,3,4,null,"Tagi, 24.01.22","w","w","w","w","w","w","w","w","w","w",0]
[null,null,"w",3,"w","w",2,"w","x","w","w","w",3,null,null,"w","w","w","w","w","w","w","x","w","w",1,null,null,"w",4,"w","w","w","w","w","w","w","w",1,null,null,"w","w","u","w","w","x","w","x","w","w",3,null,null,"w","x","x","x","x","w","w","w","w","w",4,null,null,"w","w","w","w","w","w","x","w","x","x",3,null,null,"w","w","x","w","w","k","w","w","w","w",2,null,null,"w","w","w","x","w","x","q","x","w","w",4]
[null,null,"w","x","w","w","x","w","x","w","w","w",3,null,null,"w","w","w","w","w","w","w","x","w","w",1,null,null,"w",4,"w","w","w","w","w","w","w","w",1,null,null,"w","w","x","w","w","w","w","w","w","w",1,null,null,"w","w","w","w","w","w","w","x","w","x",2,null,null,"w","w","k","w","w","w","x","w","w","w",2,null,null,"x","w","x","w","w","w","w","w","w","x",3,null,null,3,"w","w","x","w","w","w","w","w","x",3]
[null,null,"w","x","w","w","w","w","x","w",4,"w",3,null,null,"w",3,"w","w","w","w","w","x","w","x",3,null,null,"w",4,"w","w","w","x","x","w","w","w",3,null,null,"w","w","w","w","w","w","w","k","w","w",1,null,null,"x","q","x","w","w","x","w","x","w","w",5,null,null,"w","w","w","w","x","w","x","w","x","w",3,null,null,"w","w","w","w","x","x","w","w","w","x",3,null,null,3,"w","w","x","w","w","x","w","w","w",3]
[null,null,"w","w","w","w","w","w","w","w",4,"w",1,null,null,"w",3,"w","w","x","x","w","w","w","w",3,null,null,"w",4,"w","w","w","w","w","w","w","w",1,null,null,"w","w","w","w","w","w","w","w","w","w",0,null,null,"w","w","w","w","w","w","w","w","w","w",0,null,null,"w","w","w","w","x","w","x","w","x","w",3,null,null,"w","w","w","w","w","w","w","w","w","w",0,null,null,3,"w","w","x","w","w","x","w","w","w",3]
[null,null,"w","w","r","x","w","w","w","w",4,"w",3,null,null,"w",3,"w","w","w","w","w","w","x","w",2,null,null,"w","w","w","w","w","w","w","w","w","w",0,null,null,"w","w","x","w","w","w","x","x","q","x",5,null,null,"w","w","w","w","w","w","w","w","w","w",0,null,null,"w","w","x","w","x","w","w","w","w","w",2,null,null,"w","w","x","w","w","w","x","q","x","w",4,null,null,"w","w","w","w","w","w","w","w","x","w",1]
[null,null,"w","w","w","w","w","w","x","w",4,"w",2,null,null,"w","w","w","w","w","w","w","w","q","w",1,null,null,3,"w","w","w","w","w","w",3,"w","w",2,null,null,"x","w",3,"w","u","w","w","w","w","w",3,null,null,"w","k","w","w","w","w","w","w","w","w",1,null,null,"w","w","w","w","w","w","r","l","w","w",2,null,null,"x","w","w","w","w","w","w","w","w","w",1,null,null,"w","w","w","x","w","w","w","w","o","w",2]
[null,null,"w","w","w","w","w","w","w","w","w","w",0,null,null,"w","w","w","w","w","w","w","w","x","w",1,null,null,3,"w","w","k","w","w","w",3,"w","x",4,null,null,"w","w",3,"w","x","w","w","w","w","w",2,null,null,"w","w","w","w","r","l","w","w","w","w",2,null,null,"w","w","w","x","w","w","w","w","w","x",2,null,null,"o","w","w","w","w","w","w","w","w","w",1,null,null,"w","w","w","w","w","w","w","w","w","w",0]
[null,null,"w","w","r","l","w","w","w","w","w","w",2,null,null,"x","x","w","w","x","w","w","w","w","w",3,null,null,3,"w","w","w","w","k","w",3,"w","w",3,null,null,"w","w","w","w","x","w","x","x","w","w",3,null,null,"w","x","x","w","w","w","w","w","w","w",2,null,null,"w","w","w","w","w","x","x","x","w","w",3,null,null,"w","w","x","w","w","w","w","w","w","w",1,null,null,"w","w","w",2,2,"w","w","w","k","w",3]
[null,{"$f":"SUM(C724:L724)","v":20},1,3,2,2,2,0,5,0,4,1,{"$f":"SUM(M714:M723)","v":20},null,{"$f":"SUM(P724:Y724)","v":20},2,4,0,0,4,1,0,4,3,2,{"$f":"SUM(Z714:Z723)","v":20},null,{"$f":"SUM(AC724:AL724)","v":20},3,4,1,1,2,2,3,3,0,1,{"$f":"SUM(AM714:AM723)","v":20},null,{"$f":"SUM(AP724:AY724)","v":20},1,0,5,1,3,2,2,4,1,1,{"$f":"SUM(AZ714:AZ723)","v":20},null,{"$f":"SUM(BC724:BL724)","v":20},1,4,4,1,2,2,0,3,1,2,{"$f":"SUM(BM714:BM723)","v":20},null,{"$f":"SUM(BP724:BY724)","v":20},0,0,2,1,3,1,6,2,3,2,{"$f":"SUM(BZ714:BZ723)","v":20},null,{"$f":"SUM(CC724:CL724)","v":20},3,0,6,0,1,2,1,2,2,3,{"$f":"SUM(CM714:CM723)","v":20},null,{"$f":"SUM(CP724:CY724)","v":20},3,1,0,6,1,1,3,1,3,1,{"$f":"SUM(CZ714:CZ723)","v":20}]
[]
[null,null,"Tagi, 25.01.22",null,null,null,null,null,null,null,null,null,null,null,null,"Tagi, 26.01.22",null,null,null,null,null,null,null,null,null,null,null,null,"Tagi, 27.01.22",null,null,null,null,null,null,null,null,null,null,null,null,"Tagi, 28.01.22",null,null,null,null,null,null,null,null,null,null,null,null,"Tagi, 29.01.22",null,null,null,null,null,null,null,null,null,null,null,null,"Tagi, 31.01.22",null,null,null,null,null,null,null,null,null,null,null,null,"Tagi, 01.02.22",null,null,null,null,null,null,null,null,null,null,null,null,"Migros-Magazin, 31.01.22"]
[null,233,null,null,null,null,null,null,null,null,null,null,4,null,234,null,null,null,null,null,null,null,null,"l",null,2,null,235,null,"w",null,null,null,null,null,null,null,null,1,null,236,null,null,null,null,null,null,null,null,null,"k",1,null,237,"k",null,null,null,null,null,null,null,null,null,4,null,238,null,null,null,null,null,null,null,null,null,null,1,null,239,null,null,null,null,null,null,null,null,null,null,1,null,240,null,null,null,null,null,null,null,null,null,null,6]
[null,"Tagi, 25.01.22",null,null,null,null,null,null,null,null,"k",null,1,null,"Tagi, 26.01.22",null,null,null,null,null,null,null,null,null,null,2,null,"Tagi, 27.01.22",null,null,null,null,null,null,null,null,null,null,5,null,"Tagi, 28.01.22",null,null,null,null,null,null,null,null,null,null,3,null,"Tagi, 29.01.22",null,null,null,null,null,null,null,null,null,null,0,null,"Tagi, 31.01.22",null,null,null,null,null,null,null,null,null,null,3,null,"Tagi, 01.02.22",null,null,null,null,null,null,"w",null,null,null,2,null,"Migros-Magazin, 31.01.22",null,null,null,null,null,null,null,null,null,null,1]
[null,null,null,"l",null,null,null,null,null,null,null,null,3,null,null,null,null,null,null,null,null,null,null,null,null,0,null,null,null,null,null,null,null,null,null,null,null,null,0,null,null,null,null,null,null,null,null,null,null,null,null,3,null,null,null,null,null,null,null,null,null,null,null,null,4,null,null,"k",null,null,null,null,null,null,null,null,null,2,null,null,null,null,null,null,null,null,null,null,"q",null,4,null,null,null,null,null,null,null,null,null,null,null,null,2]
[null,null,null,null,null,null,null,null,null,null,null,null,0,null,null,null,null,null,null,null,null,"w",null,null,null,3,null,null,null,null,"k",null,null,null,null,null,null,null,1,null,null,null,null,null,null,null,null,null,null,null,null,2,null,null,null,null,null,null,null,null,null,null,null,null,2,null,null,null,null,null,null,null,null,null,null,null,null,1,null,null,null,null,null,null,null,null,null,null,null,null,1,null,null,null,null,null,null,null,null,null,null,null,null,0]
[null,null,null,null,null,null,null,null,null,null,null,null,2,null,null,null,null,null,null,null,null,null,null,null,null,1,null,null,null,null,null,null,null,null,null,null,null,null,2,null,null,null,null,null,null,null,null,null,null,null,null,0,null,null,null,null,null,null,null,null,null,null,null,null,0,null,null,null,null,null,null,null,null,null,null,null,null,5,null,null,null,null,"q",null,null,null,null,null,null,null,3,null,null,null,null,null,null,null,null,null,null,null,null,0]
[null,null,null,null,null,null,null,null,null,null,null,null,2,null,null,null,null,null,null,null,null,null,null,null,null,0,null,null,null,null,null,null,null,null,null,"o",null,null,2,null,null,null,"u",null,null,null,null,null,null,null,null,1,null,null,null,null,null,null,null,null,null,null,null,null,1,null,null,null,null,null,null,null,null,null,null,null,null,2,null,null,null,null,null,null,null,null,null,null,null,null,1,null,null,null,null,null,null,"q",null,null,null,null,null,4]
[null,null,"w",null,null,null,null,"o",null,null,null,null,3,null,null,null,null,null,null,null,null,null,null,null,null,5,null,null,null,null,null,null,null,null,null,null,null,null,5,null,null,null,null,null,null,null,null,"w",null,null,null,4,null,null,null,null,null,null,null,"l",null,"o",null,null,3,null,null,null,null,null,null,null,null,null,null,null,null,0,null,null,null,null,null,null,null,null,null,null,null,null,1,null,null,null,null,null,null,null,null,null,null,null,null,0]
[null,null,null,null,null,null,null,null,null,null,null,null,0,null,null,null,null,null,null,null,null,null,null,null,null,1,null,null,null,null,null,null,null,null,null,null,null,null,0,null,null,null,null,null,null,null,null,null,null,null,null,2,null,null,null,null,null,null,null,null,null,null,null,null,1,null,null,null,null,null,null,null,null,"k",null,null,null,2,null,null,null,null,null,null,null,null,null,null,null,null,3,null,null,null,null,null,null,null,null,null,null,null,null,2]
[null,null,null,null,null,null,null,null,null,null,null,null,2,null,null,null,null,null,null,null,null,null,null,null,null,3,null,null,null,null,null,null,null,null,null,null,null,null,2,null,null,null,null,null,null,null,null,null,null,null,null,1,null,null,null,null,null,null,null,"q",null,null,null,null,4,null,null,null,"o",null,null,null,null,null,null,null,null,2,null,null,null,null,null,null,null,"o",null,null,null,null,2,null,null,null,null,null,null,null,null,null,null,"q",null,3]
[null,null,null,null,null,null,null,null,null,null,null,null,3,null,null,null,"o",null,null,null,null,null,null,null,null,3,null,null,null,null,null,null,null,null,null,"r",null,null,2,null,null,"k",null,null,null,null,null,null,null,null,null,3,null,null,null,null,null,null,null,null,null,null,null,null,1,null,null,null,null,null,null,"o",null,null,null,null,null,2,null,null,null,null,null,null,null,null,null,null,null,null,2,null,null,null,null,null,null,null,null,null,null,null,null,2]
[null,{"$f":"SUM(C737:L737)","v":20},3,3,0,2,3,5,1,0,1,2,{"$f":"SUM(M727:M736)","v":20},null,{"$f":"SUM(P737:Y737)","v":20},3,3,1,0,2,1,3,1,2,4,{"$f":"SUM(Z727:Z736)","v":20},null,{"$f":"SUM(AC737:AL737)","v":20},3,1,1,2,3,3,1,3,2,1,{"$f":"SUM(AM727:AM736)","v":20},null,{"$f":"SUM(AP737:AY737)","v":20},2,3,2,0,4,0,3,0,4,2,{"$f":"SUM(AZ727:AZ736)","v":20},null,{"$f":"SUM(BC737:BL737)","v":20},1,1,2,3,3,4,1,3,0,2,{"$f":"SUM(BM727:BM736)","v":20},null,{"$f":"SUM(BP737:BY737)","v":20},3,3,2,2,3,0,4,0,2,1,{"$f":"SUM(BZ727:BZ736)","v":20},null,{"$f":"SUM(CC737:CL737)","v":20},1,3,4,1,1,2,2,0,5,1,{"$f":"SUM(CM727:CM736)","v":20},null,{"$f":"SUM(CP737:CY737)","v":20},4,0,4,2,1,3,2,2,1,1,{"$f":"SUM(CZ727:CZ736)","v":20}]
[null,null,"Lösung",null,null,null,null,null,null,null,null,null,null,null,null,"Lösung",null,null,null,null,null,null,null,null,null,null,null,null,"Lösung",null,null,null,null,null,null,null,null,null,null,null,null,"Lösung",null,null,null,null,null,null,null,null,null,null,null,null,"Lösung",null,null,null,null,null,null,null,null,null,null,null,null,"Lösung",null,null,null,null,null,null,null,null,null,null,null,null,"Lösung",null,null,null,null,null,null,null,null,null,null,null,null,"Lösung"]
[null,233,"w","w","w",4,4,4,4,"w","w","w",4,null,234,"w","w","w","w","w","w","w","r","l","w",2,null,235,"w","w","w","w","w","w","w","w","x","w",1,null,236,"w","w","w","w","w","w","w","w","w","k",1,null,237,"k","w","x",3,3,"w","w","w","w","w",4,null,238,"x","w","w","w","w","w","w","w","w","w",1,null,239,"w","w","w","w","w","w","w","w",4,"w",1,null,240,"x","w","x","x","w","x","x","x","w","w",6]
[null,"Tagi, 25.01.22","w","w","w","w","w","w","w","w","k","w",1,null,"Tagi, 26.01.22","x","w","w","w","x","w","w","w","w","w",2,null,"Tagi, 27.01.22","w","x","w",4,4,4,4,"w","w","w",5,null,"Tagi, 28.01.22","x","w","x","w","w","w",3,"w","w","w",3,null,"Tagi, 29.01.22","w","w","w","w","w","w","w","w","w","w",0,null,"Tagi, 31.01.22","w","w",3,3,3,"w","w","w","w","w",3,null,"Tagi, 01.02.22","w","x","w","w","w","w","w","w",4,"w",2,null,"Migros-Magazin, 31.01.22",2,"w","w","w","w","w","w","w","w","w",1]
[null,null,"x","l","w","w","x","w","w","w","w","w",3,null,null,"w","w","w","w","w","w","w","w","w","w",0,null,null,"w","w","w","w","w","w","w","w","w","w",0,null,null,"w","w","x","w","w","w",3,"w","x","w",3,null,null,"w",3,3,3,"w","x","w","w","w","w",4,null,null,"k","w","w","w","w","w","x","w","w","w",2,null,null,"w","x","w","w","x","w","x","w",4,"w",4,null,null,"w","w","w","w","w",2,2,"w","w","w",2]
[null,null,"w","w","w","w","w","w","w","w","w","w",0,null,null,"x","x","x","w","w","w","w","w","w","w",3,null,null,"w","w","k","w","w","w","w","w","w","w",1,null,null,"w","w","w","w","w","w",3,"w","x","w",2,null,null,"w","w","w","w","w","x","w","x","w","w",2,null,null,"w","w","w","w","w","w","x","w","w","w",1,null,null,"w","w","w","w","w","w","w","w",4,"w",1,null,null,"w","w","w","w","w","w","w","w","w","w",0]
[null,null,"x","w","w","w","w",3,"w","w","w","w",2,null,null,"w","w","w","w","w","w","w","w","x","w",1,null,null,3,"w","w","w","w","w","w","x","w","w",2,null,null,"w","w","w","w","w","w","w","w","w","w",0,null,null,"w","w","w","w","w","w","w","w","w","w",0,null,null,"x",4,4,4,"w","w","x","w","w","w",5,null,null,"w","x","q","x","w","w","w","w","w","w",3,null,null,"w","w","w","w","w","w","w","w","w","w",0]
[null,null,"w","w","w","w","w",3,"w","w","w","x",2,null,null,"w","w","w","w","w","w","w","w","w","w",0,null,null,3,"w","w","w","w","w","w","o","w","w",2,null,null,"w","x","w","w","w","w","w","w","w","w",1,null,null,"w","w","w","w","w","w","w","x","w","w",1,null,null,"w","w","w","w","w","w","w","w","x","x",2,null,null,"w","w","w","w","w","w","x","w","w","w",1,null,null,"w","w",4,4,4,4,"w","w","w","w",4]
[null,null,"w","x","w","w","w",3,"w","w","w","x",3,null,null,"x","w","w","w",3,3,3,"w","w",4,5,null,null,3,"w","w",3,3,3,"w","w","w","x",5,null,null,"w","x","w","w",4,"w","w","w","x","x",4,null,null,"w","w","w","w","x","l","w","o","w","w",3,null,null,"w","w","w","w","w","w","w","w","w","w",0,null,null,"w","w","x","w","w","w","w","w","w","w",1,null,null,"w","w","w","w","w","w","w","w","w","w",0]
[null,null,"w","w","w","w","w","w","w","w","w","w",0,null,null,"w","w","w","w","w","w","w","w","w",4,1,null,null,"w","w","w","w","w","w","w","w","w","w",0,null,null,"w","x","w","w",4,"w","w","w","w","w",2,null,null,"w","w","w","w","w","w","w","w","w","x",1,null,null,"w","x","w","w","w","w","k","w","w","w",2,null,null,"x","w",3,"w","w","u","w","w","w","w",3,null,null,"x","w","x","w","w","w","w","w","w","w",2]
[null,null,"x","x","w","w","w","w","w","w","w","w",2,null,null,"w","x","w","w","w","w","x","w","w",4,3,null,null,"w","w","w","w","x","x","w","w","w","w",2,null,null,"w","w","w","w",4,"w","w","w","w","w",1,null,null,"w","w","w","x","x","x","x","w","w","w",4,null,null,"w","o","w","w","x","w","w","w","w","w",2,null,null,"w","w",3,"w","w","o","w","w","w","w",2,null,null,"w","w","w","w","w","w","w","x","q","x",3]
[null,null,"w","w","w",3,3,3,"w","w","w","w",3,null,null,"w","o","w","w","w","w","x","w","w",4,3,null,null,"w","w","w","w","w","w","w","r","l","w",2,null,null,"k","w","w","w",4,"w","w","w","x","w",3,null,null,"w","w","w","w","w","w","w","w","w","x",1,null,null,"w","w","w","w","o","w","w","w","x","w",2,null,null,"w","w","w","w","w","w","w","w",2,2,2,null,null,"x","w","x","w","w","w","w","w","w","w",2]
[null,{"$f":"SUM(C749:L749)","v":20},3,3,0,2,3,5,1,0,1,2,{"$f":"SUM(M739:M748)","v":20},null,{"$f":"SUM(P749:Y749)","v":20},3,3,1,0,2,1,3,1,2,4,{"$f":"SUM(Z739:Z748)","v":20},null,{"$f":"SUM(AC749:AL749)","v":20},3,1,1,2,3,3,1,3,2,1,{"$f":"SUM(AM739:AM748)","v":20},null,{"$f":"SUM(AP749:AY749)","v":20},2,3,2,0,4,0,3,0,4,2,{"$f":"SUM(AZ739:AZ748)","v":20},null,{"$f":"SUM(BC749:BL749)","v":20},1,1,2,3,3,4,1,3,0,2,{"$f":"SUM(BM739:BM748)","v":20},null,{"$f":"SUM(BP749:BY749)","v":20},3,3,2,2,3,0,4,0,2,1,{"$f":"SUM(BZ739:BZ748)","v":20},null,{"$f":"SUM(CC749:CL749)","v":20},1,3,4,1,1,2,2,0,5,1,{"$f":"SUM(CM739:CM748)","v":20},null,{"$f":"SUM(CP749:CY749)","v":20},4,0,4,2,1,3,2,2,1,1,{"$f":"SUM(CZ739:CZ748)","v":20}]
[]
[null,null,"Tagi, 02.02.22",null,null,null,null,null,null,null,null,null,null,null,null,"Tagi, 03.02.22",null,null,null,null,null,null,null,null,null,null,null,null,"Tagi, 04.02.22",null,null,null,null,null,null,null,null,null,null,null,null,"Tagi, 05.02.22",null,null,null,null,null,null,null,null,null,null,null,null,"Tagi, 07.02.22",null,null,null,null,null,null,null,null,null,null,null,null,"Migros-Magazin, 07.02.22",null,null,null,null,null,null,null,null,null,null,null,null,"Tagi, 08.02.22",null,null,null,null,null,null,null,null,null,null,null,null,"Tagi, 09.02.22"]
[null,241,null,null,null,null,null,null,null,null,null,null,1,null,242,null,null,null,null,null,null,null,null,null,null,3,null,243,null,"u",null,null,null,null,null,null,null,null,1,null,244,null,null,null,null,null,null,null,null,null,null,3,null,245,null,null,null,null,null,null,null,null,null,null,4,null,246,null,"k",null,null,null,null,null,null,null,null,1,null,247,null,null,null,null,null,null,null,null,null,null,2,null,248,"r",null,null,null,null,null,null,null,null,null,2]
[null,"Tagi, 02.02.22",null,null,null,null,null,null,null,null,null,null,0,null,"Tagi, 03.02.22",null,null,null,null,null,null,null,null,null,null,1,null,"Tagi, 04.02.22",null,null,null,null,"k",null,null,null,null,null,2,null,"Tagi, 05.02.22",null,null,null,null,null,null,null,null,null,null,0,null,"Tagi, 07.02.22",null,null,null,null,null,null,null,null,null,null,2,null,"Migros-Magazin, 07.02.22",null,null,null,null,null,null,null,null,null,null,2,null,"Tagi, 08.02.22",null,null,null,null,"w",null,null,null,"r",null,5,null,"Tagi, 09.02.22",null,null,null,null,null,null,null,null,null,null,0]
[null,null,null,null,null,null,null,null,null,null,null,null,2,null,null,null,"o",null,null,null,null,null,null,null,null,5,null,null,null,null,null,null,null,null,null,null,null,null,1,null,null,null,null,null,null,null,null,null,null,null,null,1,null,null,null,null,null,null,null,null,"q",null,null,null,1,null,null,null,null,null,null,null,null,null,null,null,null,5,null,null,null,null,null,null,null,null,null,null,null,null,0,null,null,null,null,null,null,null,null,null,null,null,null,3]
[null,null,null,null,null,"k",null,null,null,null,null,null,3,null,null,null,null,null,null,null,"u",null,null,null,null,1,null,null,null,null,null,null,null,null,null,null,null,null,4,null,null,null,null,"r",null,null,null,null,null,null,null,3,null,null,"k",null,null,null,null,null,null,null,null,null,3,null,null,null,null,null,null,null,null,null,null,null,null,1,null,null,null,null,null,null,null,null,null,null,null,null,2,null,null,null,null,null,null,null,null,null,null,"q",null,1]
[null,null,null,null,null,null,null,null,null,null,null,null,0,null,null,null,null,null,null,null,null,null,null,null,null,1,null,null,null,null,null,null,null,null,null,null,null,null,1,null,null,null,null,null,null,null,null,null,"r",null,null,2,null,null,null,null,null,null,null,null,null,null,null,null,1,null,null,null,null,null,null,null,null,null,null,null,null,1,null,null,null,"r",null,null,null,null,"q",null,null,null,4,null,null,null,null,null,null,null,null,null,null,null,null,3]
[null,null,null,null,null,null,null,null,null,null,null,null,0,null,null,null,null,null,null,null,null,null,"k",null,null,2,null,null,null,null,null,null,"r",null,null,null,null,null,2,null,null,null,null,null,null,null,"k",null,null,null,null,3,null,null,null,null,null,null,null,null,null,null,null,null,3,null,null,null,null,null,null,null,null,null,null,"r",null,2,null,null,null,null,null,null,null,null,null,null,null,null,2,null,null,null,null,null,null,null,null,null,null,null,null,3]
[null,null,null,null,null,null,null,null,null,null,null,null,5,null,null,null,null,null,null,null,null,null,null,null,null,2,null,null,null,null,null,null,null,null,null,null,null,null,5,null,null,null,null,null,null,null,null,null,null,null,null,4,null,null,null,null,null,null,null,null,null,null,null,null,0,null,null,null,null,null,null,null,null,null,null,null,null,1,null,null,null,null,null,null,null,null,null,null,null,null,1,null,null,null,null,null,null,null,null,null,null,null,null,3]
[null,null,null,null,null,null,null,null,null,null,null,null,3,null,null,null,null,null,null,null,null,null,null,"q",null,4,null,null,null,null,null,null,null,null,null,null,null,null,0,null,null,null,null,null,null,null,null,null,null,null,null,1,null,null,null,null,null,null,null,null,null,"r",null,null,3,null,null,null,null,null,null,null,null,null,null,null,null,1,null,null,null,null,null,null,null,null,null,null,null,null,1,null,null,null,null,null,null,null,null,null,null,null,null,2]
[null,null,"k",null,null,null,null,"o",null,null,null,null,3,null,null,null,null,null,null,null,null,null,null,null,null,0,null,null,null,null,null,null,null,null,null,null,null,null,0,null,null,null,null,null,null,null,null,null,null,null,null,2,null,null,null,null,null,null,null,null,null,null,null,null,0,null,null,null,null,null,null,null,"r",null,null,null,null,3,null,null,null,null,null,null,null,null,null,null,null,null,1,null,null,null,null,null,null,null,null,null,null,null,null,2]
[null,null,null,null,null,"l",null,null,null,null,null,null,3,null,null,null,null,null,null,null,null,null,null,null,null,1,null,null,null,null,null,null,null,"w",null,null,null,null,4,null,null,null,null,null,null,null,null,null,null,null,null,1,null,null,null,null,null,"l",null,null,null,null,null,null,3,null,null,null,null,null,null,null,null,null,null,null,null,3,null,null,null,null,null,null,null,null,null,null,null,null,2,null,null,null,null,null,null,null,"o",null,null,null,null,1]
[null,{"$f":"SUM(C762:L762)","v":20},2,2,2,2,0,3,2,4,0,3,{"$f":"SUM(M752:M761)","v":20},null,{"$f":"SUM(P762:Y762)","v":20},1,2,2,1,1,4,0,4,3,2,{"$f":"SUM(Z752:Z761)","v":20},null,{"$f":"SUM(AC762:AL762)","v":20},1,3,0,2,3,2,1,2,2,4,{"$f":"SUM(AM752:AM761)","v":20},null,{"$f":"SUM(AP762:AY762)","v":20},1,4,2,2,3,1,0,3,3,1,{"$f":"SUM(AZ752:AZ761)","v":20},null,{"$f":"SUM(BC762:BL762)","v":20},4,0,1,4,0,0,6,1,2,2,{"$f":"SUM(BM752:BM761)","v":20},null,{"$f":"SUM(BP762:BY762)","v":20},3,2,5,0,0,1,4,0,4,1,{"$f":"SUM(BZ752:BZ761)","v":20},null,{"$f":"SUM(CC762:CL762)","v":20},3,1,1,3,1,0,4,0,6,1,{"$f":"SUM(CM752:CM761)","v":20},null,{"$f":"SUM(CP762:CY762)","v":20},3,1,4,0,3,2,0,3,3,1,{"$f":"SUM(CZ752:CZ761)","v":20}]
[null,null,"Lösung",null,null,null,null,null,null,null,null,null,null,null,null,"Lösung",null,null,null,null,null,null,null,null,null,null,null,null,"Lösung",null,null,null,null,null,null,null,null,null,null,null,null,"Lösung",null,null,null,null,null,null,null,null,null,null,null,null,"Lösung",null,null,null,null,null,null,null,null,null,null,null,null,"Lösung",null,null,null,null,null,null,null,null,null,null,null,null,"Lösung",null,null,null,null,null,null,null,null,null,null,null,null,"Lösung"]
[null,241,"w","x","w","w","w","w","w","w","w","w",1,null,242,"w","w","w","w","x","w","w","x","x","w",3,null,243,"w","u","w","w","w","w","w","w","w","w",1,null,244,"w","w","x","w","w","w","w",2,2,"w",3,null,245,"x","w","w","w","w","w","x","w","x","x",4,null,246,"w","k","w","w","w","w","w","w","w","w",1,null,247,"x","w","w","x","w","w","w","w","w","w",2,null,248,"r","l","w","w","w","w","w","w","w","w",2]
[null,"Tagi, 02.02.22","w","w","w","w","w","w","w","w","w","w",0,null,"Tagi, 03.02.22","w","u","w","w","w","w","w","w","w","w",1,null,"Tagi, 04.02.22","w","x","w","w","k","w","w","w","w","w",2,null,"Tagi, 05.02.22","w","w","w","w","w","w","w","w","w","w",0,null,"Tagi, 07.02.22","x","w","w","w","w","w","x","w","w","w",2,null,"Migros-Magazin, 07.02.22","w","w","w","w","w","w","x","w","x","w",2,null,"Tagi, 08.02.22","x","w","w","x","w","w","x","w","r","x",5,null,"Tagi, 09.02.22","w","w","w","w","w","w","w","w","w","w",0]
[null,null,"w","w","w","w","w","w",2,"w","w",2,2,null,null,"w","o","w","x","w","w","w","x","x","x",5,null,null,"w","w","w","w","w","w","w","w","w","x",1,null,null,"x","w","w","w","w","w","w","w","w","w",1,null,null,"w","w","w","w","w","w",4,"w","w","w",1,null,null,"x","x","x","w","w","w","x","w","x","w",5,null,null,"w","w","w","w","w","w","w","w","w","w",0,null,null,"x","w","w","w","x","w","w","w","x","w",3]
[null,null,"w","w","w","k","w","w",2,"w","w",2,3,null,null,"w","w","w","w","w","u","w","w","w","w",1,null,null,"w","w","w","x","x","x","x","w","w","w",4,null,null,"w","w",3,3,3,"w","w","w","w","w",3,null,null,"k","w","w",3,"w","w",4,"w","w","w",3,null,null,"w","w","w","w","w","w","x","w","w","w",1,null,null,"w","w","w","w","w","w","x","w","x","w",2,null,null,"w","w","w","w","w","w","w","w","q","w",1]
[null,null,"w","w","w","w","w","w","w","w","w","w",0,null,null,"w","w","w","w","w",4,"w","w","w","w",1,null,null,"w","w","w","w","w","w","w","w","w","x",1,null,null,"w","w","w","w","w","w","w","r","l","w",2,null,null,"w","w","w",3,"w","w","w","w","w","w",1,null,null,"x","w","w","w","w","w","w","w","w","w",1,null,null,"w","r",3,3,"w","w","q","w","w","w",4,null,null,"w","w",4,"w","x","w","w","w","x","w",3]
[null,null,"w","w","w","w","w","w","w","w","w","w",0,null,null,"w","w","w","w","w",4,"w","k","w","w",2,null,null,"w","w","w","w","r","l","w","w","w","w",2,null,null,"w","x","w","x","w","k","w","w","w","w",3,null,null,"x","w","w",3,"w","w","x","w","w","w",3,null,null,"w","w","w","w","w","w","w","w","r","l",2,null,null,"w","w","w","w","w","w","x","w","x","w",2,null,null,"x","w",4,"w","x","w","w","w","w","w",3]
[null,null,3,3,3,"w","w",3,"w",4,"w","w",5,null,null,"w","w",2,"w","w",4,"w","w","w","w",2,null,null,"x","x","w","w","w","w","w","x","x","x",5,null,null,"w","x","w","w","w","w","w","x","x","x",4,null,null,"w","w","w","w","w","w","w","w","w","w",0,null,null,"w","w",4,"w","w","w","w","w","w","w",1,null,null,"w","w","w","w","w","w","w","w","x","w",1,null,null,"w","w",4,"w","w","w","w","x","w","x",3]
[null,null,"w","w","w","w","w",3,"w",4,"w","x",3,null,null,"w","w",2,"w","w","w","w","x","q","x",4,null,null,"w","w","w","w","w","w","w","w","w","w",0,null,null,"w","x","w","w","w","w","w","w","w","w",1,null,null,"w","w","w","w","w","w","w",3,3,3,3,null,null,"w","w",4,"w","w","w","w","w","w","w",1,null,null,"w","w","w","w","w","w","w","w","x","w",1,null,null,"w","w",4,"w","w","w","w","x","w","w",2]
[null,null,"k","w","w","w","w",3,"w",4,"w","w",3,null,null,"w","w","w","w","w","w","w","w","w","w",0,null,null,"w","w","w","w","w","w","w","w","w","w",0,null,null,"w","x","w","w",2,"w","w","w","w","w",2,null,null,"w","w","w","w","w","w","w","w","w","w",0,null,null,"w","w",4,"w","w","r","x","w","w","w",3,null,null,"w","w","w","w","w","w","w","w","x","w",1,null,null,"w","w","w","w","w","u","w","x","w","w",2]
[null,null,"w","w","x","l","w","w","w",4,"w","w",3,null,null,"x","w","w","w","w","w","w","w","w","w",1,null,null,"w","w","w","x","w","w","w","x","x","x",4,null,null,"w","w","w","w",2,"w","w","w","w","w",1,null,null,"w","w","x","l","w","w","x","w","w","w",3,null,null,"x","w",4,"w","w","w","w","w","x","w",3,null,null,"x","w","w","w","x","w","w","w","w","w",2,null,null,"w","w","w","w","w","o","w","w","w","w",1]
[null,{"$f":"SUM(C774:L774)","v":20},2,2,2,2,0,3,2,4,0,3,{"$f":"SUM(M764:M773)","v":20},null,{"$f":"SUM(P774:Y774)","v":20},1,2,2,1,1,4,0,4,3,2,{"$f":"SUM(Z764:Z773)","v":20},null,{"$f":"SUM(AC774:AL774)","v":20},1,3,0,2,3,2,1,2,2,4,{"$f":"SUM(AM764:AM773)","v":20},null,{"$f":"SUM(AP774:AY774)","v":20},1,4,2,2,3,1,0,3,3,1,{"$f":"SUM(AZ764:AZ773)","v":20},null,{"$f":"SUM(BC774:BL774)","v":20},4,0,1,4,0,0,6,1,2,2,{"$f":"SUM(BM764:BM773)","v":20},null,{"$f":"SUM(BP774:BY774)","v":20},3,2,5,0,0,1,4,0,4,1,{"$f":"SUM(BZ764:BZ773)","v":20},null,{"$f":"SUM(CC774:CL774)","v":20},3,1,1,3,1,0,4,0,6,1,{"$f":"SUM(CM764:CM773)","v":20},null,{"$f":"SUM(CP774:CY774)","v":20},3,1,4,0,3,2,0,3,3,1,{"$f":"SUM(CZ764:CZ773)","v":20}]
[]
[null,null,"Tagi, 10.02.22",null,null,null,null,null,null,null,null,null,null,null,null,"Tagi, 12.02.22",null,null,null,null,null,null,null,null,null,null,null,null,"Tagi, 14.02.22",null,null,null,null,null,null,null,null,null,null,null,null,"Tagi, 15.02.22",null,null,null,null,null,null,null,null,null,null,null,null,"Beobachter, 04.02.22",null,null,null,null,null,null,null,null,null,null,null,null,"Tagi, 16.02.22",null,null,null,null,null,null,null,null,null,null,null,null,"Tagi, 17.02.22",null,null,null,null,null,null,null,null,null,null,null,null,"Tagi, 18.02.22"]
[null,249,null,null,null,null,null,null,null,null,null,null,3,null,250,null,null,null,null,null,null,null,null,null,null,2,null,251,null,null,null,"k",null,null,null,null,null,null,1,null,252,null,null,"r",null,null,null,null,null,null,null,4,null,253,null,null,null,null,null,null,null,null,null,null,0,null,254,null,null,null,"k",null,null,null,null,null,null,5,null,255,null,null,null,null,null,null,null,"k",null,null,1,null,256,null,null,null,null,null,null,null,null,null,null,2]
[null,"Tagi, 10.02.22",null,null,"w",null,null,null,null,null,null,null,2,null,"Tagi, 12.02.22","k",null,null,null,null,null,null,"r",null,null,4,null,"Tagi, 14.02.22",null,null,null,null,null,null,null,null,null,null,4,null,"Tagi, 15.02.22",null,null,null,null,null,null,null,null,null,null,1,null,"Beobachter, 04.02.22",null,null,null,null,null,null,null,null,null,null,0,null,"Tagi, 16.02.22",null,null,null,null,null,null,null,null,null,null,0,null,"Tagi, 17.02.22",null,null,null,null,null,null,null,null,null,null,2,null,"Tagi, 18.02.22",null,null,null,null,null,null,null,null,null,null,2]
[null,null,null,null,null,null,null,null,null,null,null,null,1,null,null,null,null,null,null,null,"o",null,null,null,null,1,null,null,null,null,null,null,null,null,null,null,null,null,5,null,null,null,null,null,null,null,null,null,null,null,null,1,null,null,null,null,null,null,null,null,null,null,null,null,2,null,null,null,null,null,null,null,null,null,null,null,null,0,null,null,null,null,null,null,null,null,null,"r",null,null,3,null,null,null,null,null,"o",null,null,null,null,null,null,2]
[null,null,null,null,null,null,null,null,null,null,null,null,3,null,null,null,null,null,null,null,null,null,null,null,null,1,null,null,null,null,null,null,null,null,null,null,null,null,1,null,null,null,null,null,null,null,null,null,null,null,null,2,null,null,null,null,null,null,null,"k",null,null,null,"u",3,null,null,null,null,null,null,null,null,null,null,null,null,3,null,null,null,null,null,null,null,null,null,null,null,null,4,null,null,null,null,null,null,null,null,null,null,"q",null,2]
[null,null,null,null,null,null,null,null,"k",null,null,null,1,null,null,null,null,null,null,null,null,null,null,null,null,1,null,null,null,null,null,null,null,null,null,null,null,null,1,null,null,null,null,null,null,null,null,null,null,null,null,1,null,null,null,null,null,null,null,null,null,null,null,null,1,null,null,null,null,null,null,null,null,null,null,null,null,4,null,null,null,null,null,null,null,null,null,null,"k",null,2,null,null,null,null,null,null,null,null,null,null,null,null,3]
[null,null,null,null,null,null,"l",null,null,null,null,null,2,null,null,null,null,null,null,null,null,null,null,null,null,1,null,null,null,null,null,null,null,null,null,null,null,null,0,null,null,null,null,null,null,null,null,"o",null,null,null,4,null,null,null,null,null,null,null,null,null,null,null,null,4,null,null,null,null,null,null,null,null,null,null,null,null,0,null,null,null,null,null,null,null,null,null,null,null,null,1,null,null,null,null,null,null,null,null,null,null,null,null,1]
[null,null,null,null,null,null,null,null,null,null,null,null,1,null,null,null,null,null,null,null,null,null,null,null,null,0,null,null,null,null,null,null,null,null,null,null,null,null,1,null,null,"u",null,null,null,null,null,null,null,null,null,1,null,null,null,null,null,null,null,null,null,null,null,null,1,null,null,null,null,null,null,null,null,null,null,null,null,4,null,null,null,null,null,null,null,null,null,null,null,null,1,null,null,null,null,null,null,null,null,null,null,null,null,1]
[null,null,"q",null,null,null,null,null,null,null,null,null,2,null,null,null,null,null,null,null,null,null,null,null,null,4,null,null,null,null,null,null,null,null,null,null,null,null,1,null,null,null,null,null,null,null,null,null,null,null,null,3,null,null,null,null,null,null,null,null,null,null,null,null,1,null,null,null,null,null,null,null,null,"k",null,null,null,2,null,null,null,null,null,null,null,null,null,null,null,null,0,null,null,"u",null,"w",null,null,null,null,null,null,null,2]
[null,null,null,null,null,null,null,null,null,null,null,null,3,null,null,null,null,null,null,null,null,null,null,null,null,4,null,null,null,null,null,null,null,null,null,"o",null,null,1,null,null,null,null,null,null,null,null,null,null,null,null,1,null,null,null,null,null,null,null,null,null,null,null,null,6,null,null,null,null,null,null,null,null,null,null,null,null,1,null,null,null,null,null,null,"r",null,null,null,null,null,5,null,null,null,null,null,null,null,null,null,null,null,null,1]
[null,null,null,null,null,null,null,null,null,null,null,null,2,null,null,"k",null,null,null,null,null,null,null,null,null,2,null,null,null,null,null,null,"q",null,null,null,null,null,5,null,null,null,null,null,null,"k",null,null,null,null,null,2,null,null,null,null,null,null,null,null,null,null,null,null,2,null,null,null,null,null,null,null,null,null,null,null,null,1,null,null,null,null,null,null,null,null,null,null,null,null,1,null,null,null,null,null,null,null,null,null,null,null,null,4]
[null,{"$f":"SUM(C787:L787)","v":20},3,0,4,1,7,0,2,0,0,3,{"$f":"SUM(M777:M786)","v":20},null,{"$f":"SUM(P787:Y787)","v":20},3,2,1,2,0,7,0,2,2,1,{"$f":"SUM(Z777:Z786)","v":20},null,{"$f":"SUM(AC787:AL787)","v":20},2,1,0,4,2,2,0,6,0,3,{"$f":"SUM(AM777:AM786)","v":20},null,{"$f":"SUM(AP787:AY787)","v":20},5,0,2,1,2,2,2,0,2,4,{"$f":"SUM(AZ777:AZ786)","v":20},null,{"$f":"SUM(BC787:BL787)","v":20},0,0,4,1,4,2,2,2,2,3,{"$f":"SUM(BM777:BM786)","v":20},null,{"$f":"SUM(BP787:BY787)","v":20},2,2,1,2,2,1,2,4,3,1,{"$f":"SUM(BZ777:BZ786)","v":20},null,{"$f":"SUM(CC787:CL787)","v":20},1,1,3,2,1,4,0,3,2,3,{"$f":"SUM(CM777:CM786)","v":20},null,{"$f":"SUM(CP787:CY787)","v":20},2,0,4,3,0,2,3,0,4,2,{"$f":"SUM(CZ777:CZ786)","v":20}]
[null,null,"Lösung",null,null,null,null,null,null,null,null,null,null,null,null,"Lösung",null,null,null,null,null,null,null,null,null,null,null,null,"Lösung",null,null,null,null,null,null,null,null,null,null,null,null,"Lösung",null,null,null,null,null,null,null,null,null,null,null,null,"Lösung",null,null,null,null,null,null,null,null,null,null,null,null,"Lösung",null,null,null,null,null,null,null,null,null,null,null,null,"Lösung",null,null,null,null,null,null,null,null,null,null,null,null,"Lösung"]
[null,249,"w","w","w","w",4,"w","x","w","w","x",3,null,250,"w","w","w","x","w","x","w","w","w","w",2,null,251,"w","w","w","k","w","w","w","w","w","w",1,null,252,"w","w","x","x","x","x","w","w","w","w",4,null,253,"w","w","w","w","w","w","w","w","w","w",0,null,254,"w","w","w","k","w","w",4,4,4,"x",5,null,255,"w","w","w","w","w","w","w","k","w","w",1,null,256,"w","w","w",3,"w","x","w","w","w","w",2]
[null,"Tagi, 10.02.22","w","w","w","w",4,"w","w","w","w","x",2,null,"Tagi, 12.02.22","k","w","w","w","w","x","w","r","x","w",4,null,"Tagi, 14.02.22","x","x","w","w","w","w","w",4,"w","x",4,null,"Tagi, 15.02.22","x","w","w","w","w","w","w","w","w","w",1,null,"Beobachter, 04.02.22","w","w","w","w","w","w","w","w","w","w",0,null,"Tagi, 16.02.22","w","w","w","w","w","w","w","w","w","w",0,null,"Tagi, 17.02.22","w","w","x","x","w","w","w","w","w","w",2,null,"Tagi, 18.02.22","w","w","w",3,"w","w","w","w",4,"w",2]
[null,null,"w","w","w","w",4,"w","w","w","w","w",1,null,null,"w","w","w","w","w","o","w","w","w","w",1,null,null,"w","w","w","x","x","x","w",4,"w","x",5,null,null,"x","w","w","w","w","w","w","w","w","w",1,null,null,"w","w",2,2,"w","w","w","w","w","w",2,null,null,"w","w","w","w","w","w","w","w","w","w",0,null,null,"w","w","w","w","w","w","w",3,3,3,3,null,null,"w","w","w",3,"w","w","w","w",4,"w",2]
[null,null,"w","w","x","w",4,"w","w","w","w","x",3,null,null,"w","x","w","w","w","w","w","w","w","w",1,null,null,"w","w","w","w","w","w","w",4,"w","w",1,null,null,"x","w","w","w","w","w","w","w","x","w",2,null,null,"w","w","w","w","w","k","w","x","w","u",3,null,null,2,2,"w","w","w","w","w","x","w","w",3,null,null,4,4,4,4,"w","w","w","w","w","w",4,null,null,"w","w","w","w","w","w",2,"w",4,"w",2]
[null,null,"w","w","w","w","w","w","k","w","w","w",1,null,null,"w","w","w","w","w","x","w","w","w","w",1,null,null,"w","w","w","w","w","w","w",4,"w","w",1,null,null,"w","w","w","w","w","w","u","w","w","w",1,null,null,"w","w","w","w","w","w","w","w","w","x",1,null,null,"w","w","w","x","x","x","w","x","w","w",4,null,null,"w","w","w","w","w",3,"w","w","k","w",2,null,null,"w","w","x","w","w","w",2,"w","x","w",3]
[null,null,"w","w","w","r","l","w","w","w","w","w",2,null,null,"w","w","w","w","w","x","w","w","w","w",1,null,null,"w","w","w","w","w","w","w","w","w","w",0,null,null,"w","w","x","w","w","w","o","w","x","x",4,null,null,"w","w","x","w","x","x","x","w","w","w",4,null,null,"w","w","w","w","w","w","w","w","w","w",0,null,null,"w","w","w","w","w",3,"w","w","w","w",1,null,null,"w","w","x","w","w","w","w","w","w","w",1]
[null,null,"x","w","w","w","w","w","w","w","w","w",1,null,null,"w","w","w","w","w","w","w","w","w","w",0,null,null,"w","w","w","x","w","w","w","w","w","w",1,null,null,"u","w","w","w","w","w","w","w","w","w",1,null,null,"w","w","w","w","w","w","w","w","x","w",1,null,null,3,3,3,"w","w","w","w","w","x","w",4,null,null,"w","w","w","w","w",3,"w","w","w","w",1,null,null,"w","w","x","w","w","w","w","w","w","w",1]
[null,null,"q","w",3,"w","w","w","w","w","w","w",2,null,null,4,4,4,4,"w","w","w","w","w","w",4,null,null,"w","w","w","w","w","w","w","x","w","w",1,null,null,"x","w","w","w","w","x","w","w","w",3,3,null,null,"w","w","w","w","x","w","w","w","w","w",1,null,null,"w","w","w","w","w","w","k","w","x","w",2,null,null,"w","w","w","w","w","w","w","w","w","w",0,null,null,"u","w","w","w","w","w","w","w","w","x",2]
[null,null,"x","w",3,"w","x","w","w","w","w","w",3,null,null,"w","w","w","w","w","x","w","x","x","x",4,null,null,"w","w","w","w","w","w","w","o","w","w",1,null,null,"w","w","w","w","w","w","w","w","w",3,1,null,null,"w","w","x","w","x","w","x","x","x","x",6,null,null,"w","w","w","w","x","w","w","w","w","w",1,null,null,"w","w","x","w","r","x","w","x","w","x",5,null,null,"o","w","w","w","w","w","w","w","w","w",1]
[null,null,"w","w",3,"w","x","w","w","w","w","w",2,null,null,"k","w","w","w","w","x","w","w","w","w",2,null,null,"x","w","w","x","q","x","w","w","w","x",5,null,null,"w","w","w","w","k","w","w","w","w",3,2,null,null,"w","w","x","w","x","w","w","w","w","w",2,null,null,"w","w","w","w","w","w","w","x","w","w",1,null,null,"w","w","w","w","w","w","w","w","w","x",1,null,null,"w","w","x","w","w","x","x","w","w","x",4]
[null,{"$f":"SUM(C799:L799)","v":20},3,0,4,1,7,0,2,0,0,3,{"$f":"SUM(M789:M798)","v":20},null,{"$f":"SUM(P799:Y799)","v":20},3,2,1,2,0,7,0,2,2,1,{"$f":"SUM(Z789:Z798)","v":20},null,{"$f":"SUM(AC799:AL799)","v":20},2,1,0,4,2,2,0,6,0,3,{"$f":"SUM(AM789:AM798)","v":20},null,{"$f":"SUM(AP799:AY799)","v":20},5,0,2,1,2,2,2,0,2,4,{"$f":"SUM(AZ789:AZ798)","v":20},null,{"$f":"SUM(BC799:BL799)","v":20},0,0,4,1,4,2,2,2,2,3,{"$f":"SUM(BM789:BM798)","v":20},null,{"$f":"SUM(BP799:BY799)","v":20},2,2,1,2,2,1,2,4,3,1,{"$f":"SUM(BZ789:BZ798)","v":20},null,{"$f":"SUM(CC799:CL799)","v":20},1,1,3,2,1,4,0,3,2,3,{"$f":"SUM(CM789:CM798)","v":20},null,{"$f":"SUM(CP799:CY799)","v":20},2,0,4,3,0,2,3,0,4,2,{"$f":"SUM(CZ789:CZ798)","v":20}]
[]
[null,null,"Tagi, 19.02.22",null,null,null,null,null,null,null,null,null,null,null,null,"Beobachter, 18.02.22",null,null,null,null,null,null,null,null,null,null,null,null,"Tagi, 21.02.22",null,null,null,null,null,null,null,null,null,null,null,null,"Migros-Magazin, 21.02.22",null,null,null,null,null,null,null,null,null,null,null,null,"Tagi, 22.02.22",null,null,null,null,null,null,null,null,null,null,null,null,"Tagi, 23.02.22",null,null,null,null,null,null,null,null,null,null,null,null,"Tagi, 24.02.22",null,null,null,null,null,null,null,null,null,null,null,null,"Tagi, 25.02.22"]
[null,257,null,null,null,null,null,null,null,null,null,null,3,null,258,null,null,null,null,null,null,null,null,null,null,0,null,259,null,null,null,null,"k",null,null,null,null,null,3,null,260,null,null,null,null,null,null,"k",null,null,null,1,null,261,null,null,null,null,"k",null,null,null,null,null,1,null,262,null,null,null,null,null,null,null,null,null,null,5,null,263,null,"u",null,null,null,null,null,null,null,null,4,null,264,null,null,"w",null,null,null,null,null,null,null,5]
[null,"Tagi, 19.02.22",null,null,null,null,null,null,null,null,null,null,3,null,"Beobachter, 18.02.22",null,null,null,null,null,null,null,null,null,null,0,null,"Tagi, 21.02.22",null,null,null,null,null,null,null,null,null,null,1,null,"Migros-Magazin, 21.02.22",null,null,null,"k",null,null,null,null,null,null,2,null,"Tagi, 22.02.22",null,null,null,null,null,null,null,null,"k",null,1,null,"Tagi, 23.02.22","o",null,null,null,null,null,null,null,null,null,1,null,"Tagi, 24.02.22",null,null,null,null,null,null,null,null,null,null,1,null,"Tagi, 25.02.22",null,null,null,null,null,null,null,null,null,null,0]
[null,null,null,null,null,null,null,null,null,null,null,null,2,null,null,null,null,null,null,null,null,null,null,null,null,4,null,null,null,null,null,null,null,null,null,null,null,null,0,null,null,null,null,null,null,null,null,null,null,null,null,0,null,null,null,null,null,null,null,null,null,null,null,null,5,null,null,null,null,null,null,null,null,null,null,null,null,1,null,null,null,null,null,null,null,"l",null,null,null,null,5,null,null,null,null,null,null,null,null,null,null,null,null,2]
[null,null,"o",null,null,null,null,null,null,null,null,null,4,null,null,null,null,null,null,null,null,null,null,null,null,2,null,null,"u",null,null,null,null,null,null,null,null,null,1,null,null,null,null,null,null,"q",null,null,null,null,null,4,null,null,null,null,null,null,null,null,null,null,"k",null,2,null,null,null,null,null,null,null,null,null,null,null,null,1,null,null,null,null,null,null,null,null,null,null,null,null,0,null,null,null,null,null,null,null,null,null,null,null,null,4]
[null,null,null,null,null,null,null,"l",null,null,null,null,4,null,null,null,null,null,null,null,"k",null,null,null,null,3,null,null,null,null,null,null,null,null,null,null,null,null,2,null,null,null,null,null,null,null,null,null,null,null,null,1,null,null,null,null,null,null,null,null,null,null,null,null,0,null,null,null,null,null,null,null,null,null,null,null,null,1,null,null,null,null,null,null,null,null,null,null,null,null,2,null,null,null,null,null,null,null,null,null,null,null,null,0]
[null,null,"k",null,null,null,null,null,null,null,null,null,2,null,null,null,null,null,null,null,null,null,null,null,null,1,null,null,null,null,null,null,null,null,null,null,null,null,0,null,null,null,null,null,null,null,null,null,null,null,null,2,null,null,null,null,null,null,null,null,null,null,null,null,1,null,null,null,null,null,null,null,null,null,null,null,null,2,null,null,null,null,null,null,null,null,null,null,null,null,0,null,null,null,null,null,null,null,null,null,null,null,null,0]
[null,null,null,null,null,null,null,null,null,null,null,null,0,null,null,null,null,null,null,null,null,null,null,null,null,3,null,null,null,null,null,null,"r",null,null,null,null,null,5,null,null,null,null,null,null,null,null,null,null,null,null,3,null,null,null,null,null,null,null,null,null,null,null,null,1,null,null,null,null,"l",null,null,null,null,null,null,null,4,null,null,null,null,null,null,null,null,null,null,null,null,4,null,null,null,null,null,"r",null,null,null,null,null,null,3]
[null,null,null,null,null,null,null,null,null,null,null,null,0,null,null,null,null,null,null,null,null,null,null,null,null,2,null,null,null,null,null,null,null,null,null,null,null,null,2,null,null,null,null,null,null,null,null,null,null,null,null,0,null,null,"o",null,null,null,null,null,null,null,null,null,4,null,null,null,null,null,null,null,null,null,null,null,null,0,null,null,null,null,null,null,null,null,null,null,null,null,0,null,null,null,null,null,null,null,null,null,null,null,null,2]
[null,null,null,null,null,null,null,null,null,null,null,null,0,null,null,null,null,null,null,null,null,null,null,"q",null,3,null,null,null,null,null,"u",null,null,null,null,null,null,4,null,null,null,null,null,null,null,null,null,null,null,null,2,null,null,null,null,null,null,null,null,null,null,null,null,0,null,null,null,null,null,null,null,null,null,null,null,null,4,null,null,null,null,null,"r",null,null,null,null,null,null,3,null,null,null,null,null,null,null,null,null,null,null,null,2]
[null,null,null,null,null,null,null,null,null,null,null,null,2,null,null,null,null,null,null,null,null,null,null,null,null,2,null,null,null,null,null,null,null,null,null,null,null,null,2,null,null,null,null,null,null,null,null,null,null,"l",null,5,null,null,null,null,null,null,null,null,null,null,null,null,5,null,null,null,null,null,null,null,null,null,null,null,null,1,null,null,null,null,null,null,null,null,null,null,"o",null,1,null,null,null,null,null,null,null,null,null,"k",null,null,2]
[null,{"$f":"SUM(C812:L812)","v":20},4,0,3,1,1,5,0,4,1,1,{"$f":"SUM(M802:M811)","v":20},null,{"$f":"SUM(P812:Y812)","v":20},0,0,1,5,0,3,4,2,3,2,{"$f":"SUM(Z802:Z811)","v":20},null,{"$f":"SUM(AC812:AL812)","v":20},5,2,1,2,2,2,1,0,1,4,{"$f":"SUM(AM802:AM811)","v":20},null,{"$f":"SUM(AP812:AY812)","v":20},3,2,0,4,2,1,3,3,1,1,{"$f":"SUM(AZ802:AZ811)","v":20},null,{"$f":"SUM(BC812:BL812)","v":20},2,1,3,3,4,0,2,0,3,2,{"$f":"SUM(BM802:BM811)","v":20},null,{"$f":"SUM(BP812:BY812)","v":20},3,2,1,4,1,2,0,4,2,1,{"$f":"SUM(BZ802:BZ811)","v":20},null,{"$f":"SUM(CC812:CL812)","v":20},1,3,0,1,2,1,1,4,4,3,{"$f":"SUM(CM802:CM811)","v":20},null,{"$f":"SUM(CP812:CY812)","v":20},2,5,2,1,2,0,0,3,3,2,{"$f":"SUM(CZ802:CZ811)","v":20}]
[null,null,"Lösung",null,null,null,null,null,null,null,null,null,null,null,null,"Lösung (sehr schwer)",null,null,null,null,null,null,null,null,null,null,null,null,"Lösung",null,null,null,null,null,null,null,null,null,null,null,null,"Lösung",null,null,null,null,null,null,null,null,null,null,null,null,"Lösung",null,null,null,null,null,null,null,null,null,null,null,null,"Lösung",null,null,null,null,null,null,null,null,null,null,null,null,"Lösung",null,null,null,null,null,null,null,null,null,null,null,null,"Lösung"]
[null,257,"w","w",2,"w","w","x","w",2,"w","w",3,null,258,"w","w","w","w","w","w","w","w","w","w",0,null,259,"w","x","w","w","k","w","w","w","x","w",3,null,260,"w","w","w","w","w","w","k","w","w","w",1,null,261,"w","w","w","w","k","w","w","w","w","w",1,null,262,"x","w","w",3,3,3,"w","w","x","w",5,null,263,"w","u","w","w","w","w","w","x","x","x",4,null,264,"x","x","w","w","w","w","w",3,3,3,5]
[null,"Tagi, 19.02.22","w","w",2,"w","w","x","w",2,"w","w",3,null,"Beobachter, 18.02.22","w","w","w","w","w","w","w","w","w","w",0,null,"Tagi, 21.02.22","w","x","w","w","w","w","w","w","w","w",1,null,"Migros-Magazin, 21.02.22","w","w","w","k","w","w","w","w","w","x",2,null,"Tagi, 22.02.22","w","w","w","w","w","w","w","w","k","w",1,null,"Tagi, 23.02.22","o","w","w","w","w","w","w","w","w","w",1,null,"Tagi, 24.02.22","w","x","w","w","w","w","w","w","w","w",1,null,"Tagi, 25.02.22","w","w","w","w","w","w","w","w","w","w",0]
[null,null,"x","w","w","w","w","x","w","w","w","w",2,null,null,"w","w","w","w","w","x","x","x","w","x",4,null,null,"w","w","w","w","w","w","w","w","w","w",0,null,null,"w","w","w","w","w","w","w","w","w","w",0,null,null,"w","x","x","x","x","w","x","w","w","w",5,null,null,"w","w","w","x","w","w","w","w","w","w",1,null,null,"w","x","w","w","x","l","w","x","w","x",5,null,null,"x","w","x","w","w","w","w","w","w","w",2]
[null,null,"o","w","w","w","w","w","w","x","x","x",4,null,null,"w","w","x","x","w","w","w","w","w","w",2,null,null,"u","w","w","w","w","w","w","w","w","w",1,null,null,"w","w","w","x",4,4,4,"w","w","w",4,null,null,"w","w","w","w","w","w","x","w","k","w",2,null,null,"w","w","w","w","w","w","w",4,"w","w",1,null,null,"w","w","w","w","w","w","w","w","w","w",0,null,null,"w","w","x","w","w","w","w",3,3,3,4]
[null,null,"w","w",4,4,4,4,"w","w","w","w",4,null,null,"w","w","w","w","w","k","w","x","w","x",3,null,null,"x","w","x","w","w","w","w","w","w","w",2,null,null,3,"w","w","w","w","w","w","w","w","w",1,null,null,"w","w","w","w","w","w","w","w","w","w",0,null,null,"w","w","w","w","w","w","w",4,"w","w",1,null,null,"x","w","w","w","w","w","w","x","w","w",2,null,null,"w","w","w","w","w","w","w","w","w","w",0]
[null,null,"k","w","w","w","w","w","w","x","w","w",2,null,null,"w","w","w","x","w","w","w","w","w","w",1,null,null,"w","w","w","w","w","w","w","w","w","w",0,null,null,3,"w","w","w","w","w","w","x","w","w",2,null,null,"w","w","w","w","w","w","w","w","w","x",1,null,null,"w","w","w","w","w","x","w",4,"w","w",2,null,null,"w","w","w","w","w","w","w","w","w","w",0,null,null,"w","w","w","w","w","w","w","w","w","w",0]
[null,null,"w","w","w","w","w","w","w","w","w","w",0,null,null,"w","w","w","x","w",2,2,"w","w","w",3,null,null,3,"w","w","w",3,3,3,"w","w",4,5,null,null,3,"w","w","w","x","w","w","x","w","w",3,null,null,"u","w","w","w","w","w","w","w","w","w",1,null,null,3,3,3,"w","w","w","w",4,"w","w",4,null,null,"w","w","w","w","w","w",4,4,4,4,4,null,null,"w",4,"w","r","x","w","w","w","w","w",3]
[null,null,"w","w","w","w","w","w","w","w","w","w",0,null,null,"w","w","w","x","w","w","w","w","x","w",2,null,null,3,"w","w","w","w","w","w","w","w",4,2,null,null,"w","w","w","w","w","w","w","w","w","w",0,null,null,"o","w",3,3,3,"w","w","w","w","w",4,null,null,"w","w","w","w","w","w","w","w","w","w",0,null,null,"w","w","w","w","w","w","w","w","w","w",0,null,null,"w",4,"w","w","w","w","w","w","x","w",2]
[null,null,"w","w","w","w","w","w","w","w","w","w",0,null,null,"w","w","w","x","w","w",2,"w","q","w",3,null,null,3,"w","w","u","w","x","w","w","w",4,4,null,null,"w","x","w",2,"w","w","w","w","w","w",2,null,null,"w","w","w","w","w","w","w","w","w","w",0,null,null,"w","x","w","x","w","w","w","w",2,2,4,null,null,"w","w","w","r","x","w","w","w","x","w",3,null,null,"w",4,"w","w","x","w","w","w","w","w",2]
[null,null,"x","w","w","w","w","x","w","w","w","w",2,null,null,"w","w","w","w","w","w",2,"w","x","w",2,null,null,"w","w","w","o","w","w","w","w","w",4,2,null,null,"w","x","w",2,"w","w",3,3,3,"w",5,null,null,"w","w","x","x","x","w","w","w","x","x",5,null,null,"w","w","w","x","w","w","w","w","w","w",1,null,null,"w","w","w","w","w","w","w","w","o","w",1,null,null,"w",4,"w","w","w","w","w","k","w","w",2]
[null,{"$f":"SUM(C824:L824)","v":20},4,0,3,1,1,5,0,4,1,1,{"$f":"SUM(M814:M823)","v":20},null,{"$f":"SUM(P824:Y824)","v":20},0,0,1,5,0,3,4,2,3,2,{"$f":"SUM(Z814:Z823)","v":20},null,{"$f":"SUM(AC824:AL824)","v":20},5,2,1,2,2,2,1,0,1,4,{"$f":"SUM(AM814:AM823)","v":20},null,{"$f":"SUM(AP824:AY824)","v":20},3,2,0,4,2,1,3,3,1,1,{"$f":"SUM(AZ814:AZ823)","v":20},null,{"$f":"SUM(BC824:BL824)","v":20},2,1,3,3,4,0,2,0,3,2,{"$f":"SUM(BM814:BM823)","v":20},null,{"$f":"SUM(BP824:BY824)","v":20},3,2,1,4,1,2,0,4,2,1,{"$f":"SUM(BZ814:BZ823)","v":20},null,{"$f":"SUM(CC824:CL824)","v":20},1,3,0,1,2,1,1,4,4,3,{"$f":"SUM(CM814:CM823)","v":20},null,{"$f":"SUM(CP824:CY824)","v":20},2,5,2,1,2,0,0,3,3,2,{"$f":"SUM(CZ814:CZ823)","v":20}]
[]
[null,null,"Tagi, 26.02.22",null,null,null,null,null,null,null,null,null,null,null,null,"Tagi, 28.02.22",null,null,null,null,null,null,null,null,null,null,null,null,"Migros-Magazin, 28.02.2022",null,null,null,null,null,null,null,null,null,null,null,null,"Tagi, 01.03.22",null,null,null,null,null,null,null,null,null,null,null,null,"Tagi, 02.03.22",null,null,null,null,null,null,null,null,null,null,null,null,"Tagi, 03.03.22",null,null,null,null,null,null,null,null,null,null,null,null,"Tagi, 04.03.22",null,null,null,null,null,null,null,null,null,null,null,null,"Beobachter, 04.03.22"]
[null,265,"w",null,"k",null,null,null,null,null,null,null,4,null,266,null,null,null,null,null,null,null,null,null,"w",4,null,267,"u",null,null,null,null,"k",null,null,null,null,3,null,268,null,null,null,null,null,null,null,null,null,null,3,null,269,null,null,null,null,null,null,null,null,null,null,1,null,270,null,null,null,null,null,null,null,null,null,null,2,null,271,null,null,null,null,null,null,null,null,null,null,2,null,272,null,null,null,null,null,null,null,null,null,null,0]
[null,"Tagi, 26.02.22",null,null,null,null,null,null,null,null,null,null,0,null,"Tagi, 28.02.22",null,null,null,null,null,"o",null,null,null,null,1,null,"Migros-Magazin, 28.02.2022",null,null,null,null,null,null,null,null,null,null,2,null,"Tagi, 01.03.22",null,null,null,null,null,null,null,null,null,null,0,null,"Tagi, 02.03.22",null,null,null,null,null,null,null,null,null,null,2,null,"Tagi, 03.03.22",null,null,null,null,null,null,null,null,null,null,1,null,"Tagi, 04.03.22",null,null,null,null,null,null,null,null,null,null,2,null,"Beobachter, 04.03.22",null,null,null,null,null,null,null,null,null,null,0]
[null,null,null,null,null,null,null,null,null,null,null,null,2,null,null,null,null,null,null,null,null,null,null,null,null,2,null,null,null,null,null,null,"u",null,null,null,null,null,4,null,null,null,null,null,null,null,null,null,null,null,null,0,null,null,null,null,null,null,null,null,null,null,null,null,4,null,null,null,null,null,null,null,null,null,null,null,null,4,null,null,null,null,null,null,null,null,null,null,null,null,5,null,null,null,null,null,null,null,null,"q",null,null,null,5]
[null,null,null,null,null,null,null,null,null,null,null,null,2,null,null,null,null,null,null,null,null,null,null,null,null,1,null,null,null,null,null,null,null,null,null,null,null,null,1,null,null,null,null,null,null,null,"r",null,null,null,null,2,null,null,null,null,null,null,null,null,"k",null,null,null,1,null,null,null,null,null,null,null,null,null,null,null,null,1,null,null,null,null,null,null,null,null,null,null,null,null,1,null,null,null,null,null,null,null,null,null,null,null,null,1]
[null,null,null,"o",null,null,null,null,null,null,null,null,2,null,null,null,null,null,null,null,null,null,"r",null,null,6,null,null,null,null,null,null,null,null,null,null,null,null,0,null,null,null,null,null,null,null,null,null,null,null,null,4,null,null,null,null,null,null,null,null,null,null,null,null,1,null,null,null,null,null,null,null,null,null,null,null,null,0,null,null,null,null,null,null,null,null,null,null,null,null,0,null,null,null,null,null,null,null,null,null,null,null,null,4]
[null,null,null,null,null,null,null,null,null,null,null,null,2,null,null,null,null,null,null,null,null,null,null,null,null,2,null,null,null,null,null,null,null,null,null,null,null,null,4,null,null,null,null,null,null,null,null,null,null,null,null,3,null,null,null,"k",null,null,null,null,null,null,null,null,3,null,null,null,null,null,null,null,"l",null,null,null,null,2,null,null,null,null,null,null,null,null,"r",null,null,null,2,null,null,null,null,null,null,null,null,null,null,null,null,1]
[null,null,null,null,null,null,null,null,null,null,null,null,1,null,null,null,null,null,null,null,null,"w",null,null,null,3,null,null,null,null,null,null,null,null,null,null,null,null,2,null,null,null,null,null,null,null,null,null,null,null,null,0,null,null,null,null,null,null,null,null,null,null,null,null,2,null,null,null,null,null,null,null,null,null,null,null,null,2,null,null,null,null,null,null,null,null,null,null,null,null,1,null,null,null,null,null,null,null,null,null,null,null,null,1]
[null,null,null,null,null,null,null,null,null,null,null,null,3,null,null,null,null,null,null,null,null,null,null,null,null,0,null,null,null,null,null,null,null,null,null,null,null,null,1,null,null,null,null,null,"r",null,null,null,null,null,null,5,null,null,null,null,null,null,null,null,null,null,null,null,2,null,null,null,null,null,null,"r",null,null,null,null,null,2,null,null,null,null,"k",null,null,null,null,null,null,null,3,null,null,null,null,null,null,null,"u",null,null,null,null,2]
[null,null,null,null,null,null,"r",null,null,null,null,null,3,null,null,null,null,null,null,null,null,null,null,null,null,0,null,null,null,null,null,null,"r",null,null,null,null,null,2,null,null,null,null,null,null,null,null,null,null,null,null,1,null,null,"q",null,null,null,null,null,null,null,null,null,1,null,null,null,null,null,null,null,null,null,null,null,null,2,null,null,null,null,null,null,null,null,null,"l",null,null,3,null,null,null,null,null,null,null,null,null,null,null,null,3]
[null,null,null,null,null,null,null,null,null,null,null,null,1,null,null,null,null,null,null,null,null,null,null,null,null,1,null,null,null,null,null,null,null,null,null,null,null,null,1,null,null,null,null,null,null,"w",null,null,null,null,null,2,null,null,null,null,null,null,null,null,null,null,null,null,3,null,null,"k",null,null,null,null,null,null,null,null,null,4,null,null,null,null,null,null,null,null,null,null,null,null,1,null,null,null,null,null,null,null,null,null,null,null,null,3]
[null,{"$f":"SUM(C837:L837)","v":20},2,4,1,0,2,5,0,0,0,6,{"$f":"SUM(M827:M836)","v":20},null,{"$f":"SUM(P837:Y837)","v":20},2,0,5,1,1,2,1,3,2,3,{"$f":"SUM(Z827:Z836)","v":20},null,{"$f":"SUM(AC837:AL837)","v":20},4,1,0,1,4,3,1,5,0,1,{"$f":"SUM(AM827:AM836)","v":20},null,{"$f":"SUM(AP837:AY837)","v":20},2,3,1,3,2,1,1,2,4,1,{"$f":"SUM(AZ827:AZ836)","v":20},null,{"$f":"SUM(BC837:BL837)","v":20},5,1,2,5,0,0,3,0,3,1,{"$f":"SUM(BM827:BM836)","v":20},null,{"$f":"SUM(BP837:BY837)","v":20},1,2,1,2,3,3,0,4,2,2,{"$f":"SUM(BZ827:BZ836)","v":20},null,{"$f":"SUM(CC837:CL837)","v":20},5,2,2,1,0,0,2,3,0,5,{"$f":"SUM(CM827:CM836)","v":20},null,{"$f":"SUM(CP837:CY837)","v":20},0,0,3,5,1,5,1,2,1,2,{"$f":"SUM(CZ827:CZ836)","v":20}]
[null,null,"Lösung",null,null,null,null,null,null,null,null,null,null,null,null,"Lösung",null,null,null,null,null,null,null,null,null,null,null,null,"Lösung",null,null,null,null,null,null,null,null,null,null,null,null,"Lösung",null,null,null,null,null,null,null,null,null,null,null,null,"Lösung",null,null,null,null,null,null,null,null,null,null,null,null,"Lösung",null,null,null,null,null,null,null,null,null,null,null,null,"Lösung",null,null,null,null,null,null,null,null,null,null,null,null,"Lösung"]
[null,265,"w","w","k","w","x","x","w","w","w","x",4,null,266,"w","w","x","x","w","u","w","x","w","w",4,null,267,"u","w","w","w","w","k","w",3,"w","w",3,null,268,"w","x","w","w","x","w","w","x","w","w",3,null,269,"w","w","w","w","w","w","w","w",3,"w",1,null,270,"w","w","w","w","w","w","w","x","w","x",2,null,271,"x","x","w","w","w","w","w","w","w","w",2,null,272,"w","w","w","w","w","w","w","w","w","w",0]
[null,"Tagi, 26.02.22","w","w","w","w","w","w","w","w","w","w",0,null,"Tagi, 28.02.22","w","w","w","w","w","o","w","w","w","w",1,null,"Migros-Magazin, 28.02.2022","x","w","w","w","w","w","w",3,"w","w",2,null,"Tagi, 01.03.22","w","w","w","w","w","w","w","w","w","w",0,null,"Tagi, 02.03.22","x","w","w","w","w","w","w","w",3,"w",2,null,"Tagi, 03.03.22","w","w","w","w","w","w","w","x","w","w",1,null,"Tagi, 04.03.22","w","w","w","w","w","w","w","x","w","x",2,null,"Beobachter, 04.03.22","w","w","w","w","w","w","w","w","w","w",0]
[null,null,"w","x","w","w","w","w","w","w","w","x",2,null,null,"w","w","x","w","w","w","w","w","w","x",2,null,null,"x","w","w","w","u","w","w",3,"w","x",4,null,null,"w","w","w","w","w","w","w","w","w","w",0,null,null,"x","w","x","x","w","w","w","w",3,"w",4,null,null,"w",3,3,3,"w","w","w","x","w","w",4,null,null,"x","x","x","x","w","w","w","w","w","x",5,null,null,"w","w","x","x","w","x","q","x","w","w",5]
[null,null,"w","x","w","w","w",3,"w","w","w","w",2,null,null,"w","w",4,"w","w","w","w","w","w","w",1,null,null,"w","w","w","w","x","w","w","w","w","w",1,null,null,"w","w","w","w","w","r","l","w","w","w",2,null,null,"w","w","w","w","w","w","k","w","w","w",1,null,null,"w","w","w","w","w","w","w","x","w","w",1,null,null,"w","w","w","w","w","w","w","w","w","x",1,null,null,"w","w","w","w","w","w","w","w","w","x",1]
[null,null,"w","o","w","w","w",3,"w","w","w","w",2,null,null,"x","w",4,"w","x","w","w","r","x","x",6,null,null,"w","w","w","w","w","w","w","w","w","w",0,null,null,4,4,4,4,"w","w","w","w","w","w",4,null,null,"w","w","w",4,"w","w","w","w","w","w",1,null,null,"w","w","w","w","w","w","w","w","w","w",0,null,null,"w","w","w","w","w","w","w","w","w","w",0,null,null,"w","w","x","x","x","x","w","w","w","w",4]
[null,null,"w","w","w","w","w","x","w","w","w","x",2,null,null,"x","w",4,"w","w","w","w","w","w","w",2,null,null,"w","w","w","x",4,4,4,"w","w","w",4,null,null,"w","w","w","w","w","w","w","x","x","x",3,null,null,"w","k","w",4,"w","w",2,"w","w","w",3,null,null,"w","w","w","w","r","l","w","w","w","w",2,null,null,"w","w","w","w","w","w","r","l","w","w",2,null,null,"w","w","w","w","w","w","w","w","x","w",1]
[null,null,"w","w","w","w","w","w","w","w","w","x",1,null,null,"w","w","w","w","w","w","w",3,3,3,3,null,null,"x","x","w","w","w","w","w","w","w","w",2,null,null,"w","w","w","w","w","w","w","w","w","w",0,null,null,"w","w","w",4,"w","w",2,"w","w","w",2,null,null,"w","x","w","w","w","w","w","w","x","w",2,null,null,"x","w","w","w","w","w","w","w","w","w",1,null,null,"w","w","w","x","w","w","w","w","w","w",1]
[null,null,"x","x","w","w","w","w","w","w","w","x",3,null,null,"w","w","w","w","w","w","w","w","w","w",0,null,null,"w","w","w","w","w","w","w","x","w","w",1,null,null,"x","x","w","r","x","w","w","w",3,"w",5,null,null,"x","w","w",4,"w","w","w","w","w","w",2,null,null,"w","w","w","w","r","l","w","w","w","w",2,null,null,3,"w","k","w","w","w","w","w","w","x",3,null,null,"w","w","w","x","w","u","w","w","w","w",2]
[null,null,"w","w","w","w","r","x","w","w","w","x",3,null,null,"w","w","w","w","w","w","w","w","w","w",0,null,null,"w","w","w","w","r","l","w","w","w","w",2,null,null,"w","w","w","w","w","w","w","w",3,"w",1,null,null,"q","w","w","w","w","w","w","w","w","w",1,null,null,"w","w","w","w","w","w","w","w","x","x",2,null,null,3,"w","w","w","w","w","x","l","w","w",3,null,null,"w","w","w","w","w","x","w","x","w","x",3]
[null,null,"x","w","w","w","w","w","w","w","w","w",1,null,null,"w","w","w","w","w","w","x","w","w","w",1,null,null,"w","w","w","w","w","w","w","x","w","w",1,null,null,"w","w","w","x","w","w","w","w",3,"w",2,null,null,"x","w","x","w","w","w","w","w","w","x",3,null,null,"k","w","w",3,3,"x","w","w","w","w",4,null,null,"w","w","w","w","w","w","w","w","w","x",1,null,null,"w","w","x","x","w","x","w","w","w","w",3]
[null,{"$f":"SUM(C849:L849)","v":20},2,4,1,0,2,5,0,0,0,6,{"$f":"SUM(M839:M848)","v":20},null,{"$f":"SUM(P849:Y849)","v":20},2,0,5,1,1,2,1,3,2,3,{"$f":"SUM(Z839:Z848)","v":20},null,{"$f":"SUM(AC849:AL849)","v":20},4,1,0,1,4,3,1,5,0,1,{"$f":"SUM(AM839:AM848)","v":20},null,{"$f":"SUM(AP849:AY849)","v":20},2,3,1,3,2,1,1,2,4,1,{"$f":"SUM(AZ839:AZ848)","v":20},null,{"$f":"SUM(BC849:BL849)","v":20},5,1,2,5,0,0,3,0,3,1,{"$f":"SUM(BM839:BM848)","v":20},null,{"$f":"SUM(BP849:BY849)","v":20},1,2,1,2,3,3,0,4,2,2,{"$f":"SUM(BZ839:BZ848)","v":20},null,{"$f":"SUM(CC849:CL849)","v":20},5,2,2,1,0,0,2,3,0,5,{"$f":"SUM(CM839:CM848)","v":20},null,{"$f":"SUM(CP849:CY849)","v":20},0,0,3,5,1,5,1,2,1,2,{"$f":"SUM(CZ839:CZ848)","v":20}]
[]
[null,null,"Tagi, 05.03.22",null,null,null,null,null,null,null,null,null,null,null,null,"Tagi, 07.03.22",null,null,null,null,null,null,null,null,null,null,null,null,"Migros-Magazin, 07.03.22",null,null,null,null,null,null,null,null,null,null,null,null,"Tagi, 08.03.22",null,null,null,null,null,null,null,null,null,null,null,null,"Tagi, 10.03.22",null,null,null,null,null,null,null,null,null,null,null,null,"Tagi, 09.03.22",null,null,null,null,null,null,null,null,null,null,null,null,"Tagi, 11.03.22",null,null,null,null,null,null,null,null,null,null,null,null,"Tagi, 12.03.22"]
[null,273,null,null,null,null,null,null,null,null,null,null,1,null,274,null,null,null,null,null,"w",null,null,null,null,2,null,275,null,null,null,null,null,null,null,null,"k",null,3,null,276,null,null,null,null,null,"k",null,null,null,null,1,null,277,null,null,null,null,null,null,null,null,null,null,5,null,278,null,null,null,null,null,null,null,null,null,null,1,null,279,null,null,null,null,null,null,null,null,null,null,1,null,280,null,null,null,null,null,null,null,null,null,null,1]
[null,"Tagi, 05.03.22",null,null,null,null,null,null,null,null,null,null,4,null,"Tagi, 07.03.22",null,"w",null,null,null,null,null,null,null,null,1,null,"Migros-Magazin, 07.03.22",null,null,null,null,null,null,null,null,null,null,3,null,"Tagi, 08.03.22",null,null,null,null,null,null,null,null,null,null,2,null,"Tagi, 10.03.22",null,null,null,null,null,null,null,null,null,null,0,null,"Tagi, 09.03.22",null,null,null,null,null,null,null,null,null,null,1,null,"Tagi, 11.03.22",null,null,null,"r",null,null,null,null,null,null,2,null,"Tagi, 12.03.22",null,null,null,null,null,null,"k",null,null,null,3]
[null,null,null,null,null,null,null,null,null,null,null,null,1,null,null,null,null,null,null,null,null,null,null,null,null,2,null,null,null,null,null,null,null,null,null,null,null,null,2,null,null,null,null,null,null,null,null,null,null,null,null,2,null,null,null,null,null,null,null,null,null,null,null,null,0,null,null,null,null,null,null,null,null,null,null,null,null,1,null,null,null,null,null,null,null,null,null,"k",null,null,1,null,null,null,null,null,null,null,null,null,null,null,null,1]
[null,null,"r",null,null,null,null,null,null,null,null,null,3,null,null,null,null,null,null,null,null,null,"q",null,null,5,null,null,null,null,null,null,null,null,null,null,null,null,2,null,null,null,null,null,null,null,null,null,null,"q",null,4,null,null,null,"r",null,null,null,null,null,null,null,null,3,null,null,null,null,null,null,null,null,"w",null,"u",null,4,null,null,null,null,null,null,null,null,null,null,null,null,1,null,null,null,"k",null,null,null,null,null,null,null,null,2]
[null,null,null,null,null,null,null,null,null,null,null,null,0,null,null,null,null,null,null,null,null,null,null,null,null,2,null,null,null,null,null,null,null,null,null,null,null,null,0,null,null,null,null,null,null,null,null,null,null,null,null,2,null,null,null,null,null,null,null,null,null,null,null,null,1,null,null,null,null,null,null,null,null,null,null,null,null,2,null,null,null,null,null,null,null,null,null,null,null,null,3,null,null,null,null,null,null,null,null,null,null,null,null,2]
[null,null,null,null,null,null,null,null,null,null,null,null,0,null,null,null,"k",null,null,null,null,null,null,null,null,1,null,null,null,null,null,null,null,null,null,null,null,null,1,null,null,null,null,null,null,null,null,null,null,null,null,1,null,null,null,"w",null,null,null,null,null,null,null,null,2,null,null,null,null,null,null,null,null,null,null,null,null,0,null,null,null,null,null,null,null,null,null,null,null,null,4,null,null,null,null,null,null,null,null,null,null,null,null,0]
[null,null,null,null,null,null,"r",null,null,null,"k",null,5,null,null,null,null,null,null,null,null,null,null,null,null,2,null,null,null,null,null,null,null,null,null,null,null,null,0,null,null,null,null,null,null,null,null,null,null,null,null,2,null,null,null,null,null,null,null,null,null,null,null,null,2,null,null,null,null,null,null,null,null,null,null,null,null,6,null,null,null,null,null,null,null,null,null,null,null,null,1,null,null,null,null,null,null,null,null,null,null,"q",null,3]
[null,null,null,null,null,null,null,null,null,null,null,null,1,null,null,null,null,null,null,null,null,null,null,null,null,2,null,null,null,null,null,null,null,null,null,null,null,null,3,null,null,null,"l",null,null,null,null,null,null,null,null,3,null,null,null,null,null,null,null,null,"l",null,null,null,3,null,null,null,null,"q",null,null,null,null,null,null,null,1,null,null,null,null,null,null,null,null,null,null,null,null,0,null,null,null,null,null,null,null,null,null,null,null,null,3]
[null,null,null,null,null,null,null,null,null,null,null,null,0,null,null,null,null,null,null,null,null,null,null,null,null,2,null,null,null,null,"q",null,null,null,null,null,null,null,3,null,null,null,null,null,null,null,null,null,null,null,null,1,null,null,null,null,null,null,null,null,null,null,null,null,2,null,null,null,null,null,null,null,null,null,null,null,null,3,null,null,null,null,null,null,null,null,null,null,null,null,0,null,null,null,null,null,null,null,null,null,null,null,null,1]
[null,null,null,null,"r",null,null,null,null,null,null,null,5,null,null,null,null,null,null,null,null,null,null,null,null,1,null,null,null,null,null,null,null,null,null,"o",null,null,3,null,null,null,null,null,null,null,null,null,null,"r",null,2,null,null,null,null,null,null,null,null,null,"k",null,null,2,null,null,"k",null,null,null,null,null,null,null,null,null,1,null,null,null,null,null,null,null,null,null,null,null,null,7,null,null,null,null,null,null,null,null,null,null,null,null,4]
[null,{"$f":"SUM(C862:L862)","v":20},1,5,1,1,3,2,1,2,1,3,{"$f":"SUM(M852:M861)","v":20},null,{"$f":"SUM(P862:Y862)","v":20},1,4,3,3,0,3,1,3,0,2,{"$f":"SUM(Z852:Z861)","v":20},null,{"$f":"SUM(AC862:AL862)","v":20},2,0,5,0,0,4,0,2,1,6,{"$f":"SUM(AM852:AM861)","v":20},null,{"$f":"SUM(AP862:AY862)","v":20},4,1,0,5,1,2,0,0,4,3,{"$f":"SUM(AZ852:AZ861)","v":20},null,{"$f":"SUM(BC862:BL862)","v":20},1,5,2,0,0,2,5,2,0,3,{"$f":"SUM(BM852:BM861)","v":20},null,{"$f":"SUM(BP862:BY862)","v":20},1,3,3,2,1,2,2,2,2,2,{"$f":"SUM(BZ852:BZ861)","v":20},null,{"$f":"SUM(CC862:CL862)","v":20},2,2,0,3,2,2,1,2,5,1,{"$f":"SUM(CM852:CM861)","v":20},null,{"$f":"SUM(CP862:CY862)","v":20},5,1,0,2,5,1,2,1,1,2,{"$f":"SUM(CZ852:CZ861)","v":20}]
[null,null,"Lösung",null,null,null,null,null,null,null,null,null,null,null,null,"Lösung",null,null,null,null,null,null,null,null,null,null,null,null,"Lösung",null,null,null,null,null,null,null,null,null,null,null,null,"Lösung",null,null,null,null,null,null,null,null,null,null,null,null,"Lösung",null,null,null,null,null,null,null,null,null,null,null,null,"Lösung",null,null,null,null,null,null,null,null,null,null,null,null,"Lösung",null,null,null,null,null,null,null,null,null,null,null,null,"Lösung"]
[null,273,"w","x","w","w","w","w","w","w","w","w",1,null,274,"w","w",2,"w","w","w","x","w","w","w",2,null,275,"w","w","x","w","w",4,"w","w","k","w",3,null,276,"w","w","w","w","w","k","w","w","w","w",1,null,277,"x","w","x","w","w","x","x","x","w","w",5,null,278,"w","w","w","w","w","w","w","w","w","x",1,null,279,"w","w","w","w","w","w","w","w","x","w",1,null,280,"x","w","w","w","w","w","w","w","w","w",1]
[null,"Tagi, 05.03.22","w","x","w","w","x","w","w","x","w",3,4,null,"Tagi, 07.03.22","w","w",2,"w","w","w","w","w","w","w",1,null,"Migros-Magazin, 07.03.22","x","w","x","w","w",4,"w","w","w","w",3,null,"Tagi, 08.03.22",3,"w","w","x","w","w","w","w","w","w",2,null,"Tagi, 10.03.22","w","w","w","w","w","w","w","w","w","w",0,null,"Tagi, 09.03.22","w",3,"w","w","w","w","w","w","w","w",1,null,"Tagi, 11.03.22","w","w","w","r","l","w","w","w","w","w",2,null,"Tagi, 12.03.22","x","w","w","w",4,"w","k","w","w","w",3]
[null,null,"w","w","w","w","w","w","w","w","w",3,1,null,null,"w","w","w","w","w","w","w","x","w","x",2,null,null,"w","w","w","w","w",4,"w","w","w","x",2,null,null,3,"w","w","w","w","w","w","w","x","w",2,null,null,"w","w","w","w","w","w","w","w","w","w",0,null,null,"w",3,"w","w","w","w","w","w","w","w",1,null,null,"w","w","w","w","w","w","w","k","w","w",1,null,null,"w","w","w","w",4,"w","w","w","w","w",1]
[null,null,"r","x","w","w","w","w","w","w","w",3,3,null,null,4,4,4,4,"w","w","w","q","w","w",5,null,null,"w","w","w","w","w",4,"w","w","w","x",2,null,null,3,"w","w",4,"w","x","w","w","q","w",4,null,null,"w","r","x","w","w","w","x","w","w","w",3,null,null,"w","x","w",2,"w","x","w","w","u","w",4,null,null,"w","w","w","w","w","x","w","w","w","w",1,null,null,"w","k","w","w",4,"w","w","w","w","w",2]
[null,null,"w","w","w","w","w","w","w","w","w","w",0,null,null,"w","w","w","w","w","w","w","x","w","x",2,null,null,"w","w","w","w","w","w","w","w","w","w",0,null,null,"w","w","w",4,"w","w","w","w","x","w",2,null,null,"w","w","w","w","w","w","x","w","w","w",1,null,null,"w","w","w",2,"w","w","w","w","o","w",2,null,null,"x","x","w","w","w","w","w","w","x","w",3,null,null,"w","w","w","w",4,"w","w","w","w","x",2]
[null,null,"w","w","w","w","w","w","w","w","w","w",0,null,null,"w","k","w","w","w","w","w","w","w","w",1,null,null,"w","w","w","w","w","w","w","w","w","x",1,null,null,"w","w","w",4,"w","w","w","w","w","w",1,null,null,"w","w","w","w","w","w","x","w","w","x",2,null,null,"w","w","w","w","w","w","w","w","w","w",0,null,null,"w","w","w",3,3,3,"w","w","x","w",4,null,null,"w","w","w","w","w","w","w","w","w","w",0]
[null,null,"w","x","w","w","r","x","x","w","k","w",5,null,null,"w","w","w",2,"w","x","w","w","w","w",2,null,null,"w","w","w","w","w","w","w","w","w","w",0,null,null,"w","w","w",4,"w","w","w","w","w","x",2,null,null,"w",4,"w","w","w","w","w","w","w","x",2,null,null,"w","w","x","w","x","x","x","x","w","x",6,null,null,"w","w","w","w","w","w","w","w","x","w",1,null,null,"w","w","w","w","w","w","w","x","q","x",3]
[null,null,"w","x","w","w","w","w","w","w","w","w",1,null,null,"w","w","w",2,"w","x","w","w","w","w",2,null,null,"x","w","x","w","w","w","w","w","w","x",3,null,null,"x","l","w","w","w","w","w","w","w","x",3,null,null,"w",4,"w","w","w","x","l","w","w","w",3,null,null,"w","w","q","w","w","w","w","w","w","w",1,null,null,"w","w","w","w","w","w","w","w","w","w",0,null,null,"x","w","w","x",2,"w","w","w","w","w",3]
[null,null,"w","w","w","w","w","w","w","w","w","w",0,null,null,"w",2,"w","w","w","x","w","w","w","w",2,null,null,"w","w","q","w","w","w","w","u","w","x",3,null,null,"w","w","w","w","x","w","w","w","w","w",1,null,null,"w",4,"w","w","w","w","w","w","w","x",2,null,null,"w","w","x","w","w","w",2,2,"w","w",3,null,null,"w","w","w","w","w","w","w","w","w","w",0,null,null,"x","w","w","w","w","w","w","w","w","w",1]
[null,null,"w","w",4,4,4,4,"w","x","w","w",5,null,null,"w","x","w","w","w","w","w","w","w","w",1,null,null,"w","w","x","w","w","w","w","o","w","x",3,null,null,"w","w","w","w","w","w","w","w","r","l",2,null,null,"w",4,"w","w","w","w","w","k","w","w",2,null,null,"k","w","w","w","w","w","w","w","w","w",1,null,null,"x","x","w","x","w","w",4,"x","x","x",7,null,null,"x","w","w","x","w",2,2,"w","w","w",4]
[null,{"$f":"SUM(C874:L874)","v":20},1,5,1,1,3,2,1,2,1,3,{"$f":"SUM(M864:M873)","v":20},null,{"$f":"SUM(P874:Y874)","v":20},1,4,3,3,0,3,1,3,0,2,{"$f":"SUM(Z864:Z873)","v":20},null,{"$f":"SUM(AC874:AL874)","v":20},2,0,5,0,0,4,0,2,1,6,{"$f":"SUM(AM864:AM873)","v":20},null,{"$f":"SUM(AP874:AY874)","v":20},4,1,0,5,1,2,0,0,4,3,{"$f":"SUM(AZ864:AZ873)","v":20},null,{"$f":"SUM(BC874:BL874)","v":20},1,5,2,0,0,2,5,2,0,3,{"$f":"SUM(BM864:BM873)","v":20},null,{"$f":"SUM(BP874:BY874)","v":20},1,3,3,2,1,2,2,2,2,2,{"$f":"SUM(BZ864:BZ873)","v":20},null,{"$f":"SUM(CC874:CL874)","v":20},2,2,0,3,2,2,1,2,5,1,{"$f":"SUM(CM864:CM873)","v":20},null,{"$f":"SUM(CP874:CY874)","v":20},5,1,0,2,5,1,2,1,1,2,{"$f":"SUM(CZ864:CZ873)","v":20}]
[]
[null,null,"Tagi, 14.03.22",null,null,null,null,null,null,null,null,null,null,null,null,"Migros-Magazin, 14.03.22",null,null,null,null,null,null,null,null,null,null,null,null,"Tagi, 15.03.22",null,null,null,null,null,null,null,null,null,null,null,null,"Tagi, 16.03.22",null,null,null,null,null,null,null,null,null,null,null,null,"Tagi, 16.03.22 Mini",null,null,null,null,null,null,null,null,null,null,null,null,"Tagi, 17.03.22 Mini",null,null,null,null,null,null,null,null,null,null,null,null,"Tagi, 17.03.22",null,null,null,null,null,null,null,null,null,null,null,null,"Tagi, 18.03.22 Mini"]
[null,281,null,null,null,null,null,null,null,null,null,null,7,null,282,null,null,null,null,null,null,null,null,null,null,3,null,283,null,null,null,null,null,null,null,null,null,null,1,null,284,null,null,null,null,null,null,null,null,null,null,2,null,285,"w","w","w","w","w","w","w","x","x","x",3,null,286,"w","w","w","w","w","w","w","x","x","x",3,null,287,null,null,null,"l",null,null,null,null,null,null,5,null,288,"w","w","w","w","w","w","w","x","x","x",3]
[null,"Tagi, 14.03.22",null,null,null,null,null,null,null,null,null,null,0,null,"Migros-Magazin, 14.03.22",null,null,null,null,null,null,null,null,null,null,2,null,"Tagi, 15.03.22",null,null,null,null,null,null,null,null,null,null,0,null,"Tagi, 16.03.22",null,null,null,null,null,null,null,null,null,null,1,null,"Tagi, 16.03.22 Mini","w","w","w","w","w","w","w","w","w","w",0,null,"Tagi, 17.03.22 Mini","w","w","w","w","w","w","w","w","w","w",0,null,"Tagi, 17.03.22",null,null,null,null,null,null,null,null,null,null,1,null,"Tagi, 18.03.22 Mini","w","w","w","w","w","w","w","w","w","w",0]
[null,null,null,null,null,null,null,null,null,null,null,null,0,null,null,null,null,null,null,null,null,null,null,null,null,2,null,null,null,"l",null,null,null,null,null,null,null,null,5,null,null,null,null,null,null,null,null,null,null,null,null,0,null,null,"w","x","x","w","w","w","x","w","w","w",3,null,null,"w","x","x","w","w","w","x","w","w","w",3,null,null,null,null,null,null,null,null,null,null,null,null,2,null,null,"w","x","x","w","w","w","x","w","w","w",3]
[null,null,null,null,null,null,null,null,null,null,null,null,2,null,null,null,null,null,null,null,"q",null,null,null,null,1,null,null,null,null,null,null,null,null,null,null,null,null,3,null,null,null,null,null,null,null,null,"w",null,null,null,4,null,null,"w","w","w","w","w","w","w","w","w","w",0,null,null,"w","w","w","w","w","w","w","w","w","w",0,null,null,null,null,null,null,"k",null,null,null,null,null,1,null,null,"w","w","w","w","w","w","w","w","w","w",0]
[null,null,null,null,null,null,null,null,null,null,null,null,3,null,null,null,null,null,"u",null,null,null,null,null,null,2,null,null,null,null,null,null,null,null,null,null,null,null,1,null,null,null,null,null,null,null,null,null,null,null,null,2,null,null,"x","w","w","w",null,null,null,null,"r",null,3,null,null,"x","w","w","w",null,null,null,null,null,null,4,null,null,null,null,"l",null,null,null,null,null,null,null,2,null,null,"x","w","w","w",null,null,null,null,null,null,2]
[null,null,null,null,null,null,null,null,null,null,null,null,1,null,null,null,null,null,null,null,null,null,null,null,null,2,null,null,null,null,null,null,null,null,null,null,null,null,3,null,null,null,null,null,null,null,null,null,null,null,null,2,null,null,"x","w","w","w",null,null,null,null,null,null,3,null,null,"x","w","w","w",null,null,null,null,null,null,2,null,null,null,null,null,null,null,null,null,null,null,null,2,null,null,"x","w","w","w",null,null,null,null,null,null,3]
[null,null,null,null,null,null,null,null,null,null,null,null,3,null,null,null,null,null,null,null,null,null,null,null,null,0,null,null,null,null,null,null,null,null,null,null,null,null,0,null,null,"k",null,null,null,null,"u",null,null,null,null,3,null,null,"x","w","w","w",null,null,null,null,null,null,1,null,null,"x","w","w","w",null,null,null,null,null,null,3,null,null,null,null,null,null,null,null,null,null,null,null,2,null,null,"x","w","w","w",null,null,null,null,null,null,2]
[null,null,null,null,"q",null,null,null,null,null,null,null,1,null,null,null,null,null,null,null,null,null,null,null,null,2,null,null,null,null,null,null,null,null,null,null,null,null,1,null,null,null,null,null,null,null,null,null,null,null,null,1,null,null,"x","w","w","w",null,null,null,null,null,null,5,null,null,"x","w","w","w",null,null,null,null,null,null,1,null,null,null,null,null,null,null,null,null,null,null,null,2,null,null,"x","w","w","w",null,null,null,null,null,null,3]
[null,null,"k",null,null,null,null,null,null,null,null,null,2,null,null,null,null,null,null,null,null,null,null,"q",null,5,null,null,null,"w",null,null,null,null,null,null,null,null,3,null,null,null,"u",null,null,null,null,null,null,null,null,1,null,null,"w","w","w","w",null,null,null,null,null,null,1,null,null,"w","w","w","w",null,null,null,"r",null,null,2,null,null,"o",null,null,null,null,null,null,null,null,null,2,null,null,"w","w","w","w","k",null,null,null,null,null,1]
[null,null,null,null,null,null,null,null,null,null,null,null,1,null,null,"k",null,null,null,null,null,null,null,null,null,1,null,null,null,null,null,null,null,null,null,null,"l",null,3,null,null,null,null,null,null,null,null,null,null,null,null,4,null,null,"w","w","w","w",null,null,null,null,null,null,1,null,null,"w","w","w","w",null,null,null,null,null,null,2,null,null,null,null,null,null,null,null,null,null,null,null,1,null,null,"w","w","w","w",null,null,null,null,null,null,3]
[null,{"$f":"SUM(C887:L887)","v":20},2,1,3,3,1,1,2,0,6,1,{"$f":"SUM(M877:M886)","v":20},null,{"$f":"SUM(P887:Y887)","v":20},1,0,1,3,2,3,2,3,1,4,{"$f":"SUM(Z877:Z886)","v":20},null,{"$f":"SUM(AC887:AL887)","v":20},1,3,1,5,1,0,3,1,1,4,{"$f":"SUM(AM877:AM886)","v":20},null,{"$f":"SUM(AP887:AY887)","v":20},2,2,0,5,0,5,1,2,1,2,{"$f":"SUM(AZ877:AZ886)","v":20},null,{"$f":"SUM(BC887:BL887)","v":20},4,1,1,0,3,0,2,2,4,3,{"$f":"SUM(BM877:BM886)","v":20},null,{"$f":"SUM(BP887:BY887)","v":20},4,1,1,0,1,4,1,3,2,3,{"$f":"SUM(BZ877:BZ886)","v":20},null,{"$f":"SUM(CC887:CL887)","v":20},2,2,3,1,1,0,2,3,4,2,{"$f":"SUM(CM877:CM886)","v":20},null,{"$f":"SUM(CP887:CY887)","v":20},4,1,1,0,1,3,2,1,4,3,{"$f":"SUM(CZ877:CZ886)","v":20}]
[null,null,"Lösung",null,null,null,null,null,null,null,null,null,null,null,null,"Lösung",null,null,null,null,null,null,null,null,null,null,null,null,"Lösung",null,null,null,null,null,null,null,null,null,null,null,null,"Lösung",null,null,null,null,null,null,null,null,null,null,null,null,"Lösung",null,null,null,null,null,null,null,null,null,null,null,null,"Lösung",null,null,null,null,null,null,null,null,null,null,null,null,"Lösung",null,null,null,null,null,null,null,null,null,null,null,null,"Lösung"]
[null,281,"x","x","w","x",3,3,"w","w","x","x",7,null,282,"w","w","w","w","w","w","x","x","w",3,3,null,283,"w","x","w","w","w","w","w","w","w","w",1,null,284,"w","w","w","x","w",2,"w","w","w","w",2,null,285,"w","w","w","w","w","w","w","x","x","x",3,null,286,"w","w","w","w","w","w","w","x","x","x",3,null,287,"w","x","x","l","w","w","w","x","w","x",5,null,288,"w","w","w","w","w","w","w","x","x","x",3]
[null,"Tagi, 14.03.22","w","w","w","w","w","w","w","w","w","w",0,null,"Migros-Magazin, 14.03.22","w","w","w","x","w","w","w","w","w",3,2,null,"Tagi, 15.03.22","w","w","w","w","w","w","w","w","w","w",0,null,"Tagi, 16.03.22","w","w","w","w","w",2,"w","w","w","w",1,null,"Tagi, 16.03.22 Mini","w","w","w","w","w","w","w","w","w","w",0,null,"Tagi, 17.03.22 Mini","w","w","w","w","w","w","w","w","w","w",0,null,"Tagi, 17.03.22","w","w","w","w","w","w","w","x","w","w",1,null,"Tagi, 18.03.22 Mini","w","w","w","w","w","w","w","w","w","w",0]
[null,null,"w","w","w","w","w","w","w","w","w","w",0,null,null,"w","w","w","w","w","x","w","w","w",3,2,null,null,"x","l","w",4,"w","w","x","w","w","x",5,null,null,"w","w","w","w","w","w","w","w","w","w",0,null,null,"w","x","x","w","w","w","x","w","w","w",3,null,null,"w","x","x","w","w","w","x","w","w","w",3,null,null,"w","w","w","w","w","w","w","x","w","x",2,null,null,"w","x","x","w","w","w","x","w","w","w",3]
[null,null,"w","w","w","x","w","w","w","w","x","w",2,null,null,"w","w","w","w","w","q","w","w","w","w",1,null,null,"w","w","w",4,"w","w","x","w","w","x",3,null,null,"w","w","w",4,"w","w","w",3,3,3,4,null,null,"w","w","w","w","w","w","w","w","w","w",0,null,null,"w","w","w","w","w","w","w","w","w","w",0,null,null,"w","w","w","w","k","w","w","w","w","w",1,null,null,"w","w","w","w","w","w","w","w","w","w",0]
[null,null,"w","w","w","x","w","w","x","w","x","w",3,null,null,"w","w","w","u","w","x","w","w","w","w",2,null,null,"w","w","w",4,"w","w","w","w","w","w",1,null,null,"x","w","w",4,"w","w","w","w","w","w",2,null,null,"x","w","w","w","w","w","w","w","r","x",3,null,null,"x","w","w","w","w","x","w","x","w","x",4,null,null,"w","r","l","w","w","w","w","w","w","w",2,null,null,"x","w","w","w","w","x","w","w","w","w",2]
[null,null,"w","w","w","w","w","w","w","w","x","w",1,null,null,"w","w","w","x","w","w","w","x","w","w",2,null,null,"w","x","w",4,"w","w","w","w","w","x",3,null,null,"w","w","w",4,"w","w","w","w","w","x",2,null,null,"x","w","w","w","x","w","x","w","w","w",3,null,null,"x","w","w","w","w","x","w","w","w","w",2,null,null,"w","w","w","w","w","w",2,"w","x","w",2,null,null,"x","w","w","w","w","x","w","w","x","w",3]
[null,null,"w","w","x","w","w","w","x","w","x","w",3,null,null,"w","w","w","w","w","w","w","w","w","w",0,null,null,"w","w","w","w","w","w","w","w","w","w",0,null,null,"k","w","w",4,"w","u","w","w","w","w",3,null,null,"x","w","w","w","w","w","w","w","w","w",1,null,null,"x","w","w","w","w","x","w","w","w","x",3,null,null,"w","w","w","w","w","w",2,"w",4,"w",2,null,null,"x","w","w","w","w","x","w","w","w","w",2]
[null,null,"w","w","q","w","w","w","w","w","w","w",1,null,null,"w","w","x","w","x","w","w","w","w","w",2,null,null,"w","w","w","w","w","w","w","w","w","x",1,null,null,"w","w","w","w","w","x","w","w","w","w",1,null,null,"x","w","w","w","x","w","w","x","x","x",5,null,null,"x","w","w","w","w","w","w","w","w","w",1,null,null,"u","w","w","w","w","w","w","w",4,"w",2,null,null,"x","w","w","w","w","w","w","w","x","x",3]
[null,null,"k","w","x","w","w","w","w","w","w","w",2,null,null,"w","w","w","w","x","w","x","x","q","x",5,null,null,"w","w","x","x","x","w","w","w","w","w",3,null,null,"w","u","w","w","w","w","w","w","w","w",1,null,null,"w","w","w","w","x","w","w","w","w","w",1,null,null,"w","w","w","w","w","w","w","r","l","w",2,null,null,"o","w","w","w","w","w","w","w",4,"w",2,null,null,"w","w","w","w","k","w","w","w","w","w",1]
[null,null,"w","w","w","w","w","w","w","w","x","w",1,null,null,"k","w","w","w","w","w","w","w","w","w",1,null,null,"w","w","w","w","w","w","x","x","l","w",3,null,null,"w","o","w","w","w",3,3,3,"w","w",4,null,null,"w","w","w","w","w","w","w","w","x","w",1,null,null,"w","w","w","w","x","x","w","w","w","w",2,null,null,"w","w","x","w","w","w","w","w","w","w",1,null,null,"w","w","w","w","w","w","x","w","x","x",3]
[null,{"$f":"SUM(C899:L899)","v":20},2,1,3,3,1,1,2,0,6,1,{"$f":"SUM(M889:M898)","v":20},null,{"$f":"SUM(P899:Y899)","v":20},1,0,1,3,2,3,2,3,1,4,{"$f":"SUM(Z889:Z898)","v":20},null,{"$f":"SUM(AC899:AL899)","v":20},1,3,1,5,1,0,3,1,1,4,{"$f":"SUM(AM889:AM898)","v":20},null,{"$f":"SUM(AP899:AY899)","v":20},2,2,0,5,0,5,1,2,1,2,{"$f":"SUM(AZ889:AZ898)","v":20},null,{"$f":"SUM(BC899:BL899)","v":20},4,1,1,0,3,0,2,2,4,3,{"$f":"SUM(BM889:BM898)","v":20},null,{"$f":"SUM(BP899:BY899)","v":20},4,1,1,0,1,4,1,3,2,3,{"$f":"SUM(BZ889:BZ898)","v":20},null,{"$f":"SUM(CC899:CL899)","v":20},2,2,3,1,1,0,2,3,4,2,{"$f":"SUM(CM889:CM898)","v":20},null,{"$f":"SUM(CP899:CY899)","v":20},4,1,1,0,1,3,2,1,4,3,{"$f":"SUM(CZ889:CZ898)","v":20}]
[]
[null,null,"Tagi, 18.03.22"]
[null,289,"u",null,null,null,null,null,null,null,null,null,1]
[null,"Tagi, 18.03.22",null,null,null,null,null,null,null,null,"l",null,3]
[null,null,null,null,null,null,null,null,null,null,null,null,3]
[null,null,null,null,null,null,null,null,null,null,null,null,0]
[null,null,null,null,null,null,null,null,null,null,null,null,2]
[null,null,null,null,null,null,null,null,null,null,null,null,4]
[null,null,null,null,null,null,null,null,null,null,null,null,1]
[null,null,null,null,null,null,null,null,null,null,null,null,1]
[null,null,null,null,null,null,null,null,null,null,null,null,0]
[null,null,null,null,"l",null,null,null,null,"l",null,null,5]
[null,{"$f":"SUM(C912:L912)","v":20},3,4,2,0,1,3,2,3,1,1,{"$f":"SUM(M902:M911)","v":20}]
[null,null,"Lösung"]
[null,289,"u","w","w","w","w","w","w","w","w","w",1]
[null,"Tagi, 18.03.22","x","w","w","w","w","w","w","x","l","w",3]
[null,null,"x","w","x","w","w","x","w","w","w","w",3]
[null,null,"w","w","w","w","w","w","w","w","w","w",0]
[null,null,"w","x","w","w","w","w","w","w","w","x",2]
[null,null,"w","w","w","w",4,4,4,4,"w","w",4]
[null,null,"w","x","w","w","w","w","w","w","w","w",1]
[null,null,"w","x","w","w","w","w","w","w","w","w",1]
[null,null,"w","w","w","w","w","w","w","w","w","w",0]
[null,null,"w","x","l","w","w","x","x","l","w","w",5]
[null,{"$f":"SUM(C924:L924)","v":20},3,4,2,0,1,3,2,3,1,1,{"$f":"SUM(M914:M923)","v":20}]

{"sheet":"Tabelle3","index":2,"n_rows":0,"n_cols":0,"rows_kept":0,"cut":false,"hidden":false,"merged":[]}

{"sheet":"Tabelle4","index":3,"n_rows":0,"n_cols":0,"rows_kept":0,"cut":false,"hidden":false,"merged":[]}